BDBM50040931 4,5-Bis-(4-fluoro-phenylamino)-phthalic acid dimethyl ester::CHEMBL8091
SMILES: COC(=O)c1cc(Nc2ccc(F)cc2)c(Nc2ccc(F)cc2)cc1C(=O)OC
InChI Key: InChIKey=PRAKUYLJFUQFBZ-UHFFFAOYSA-N
Data: 2 IC50
Activity Spreadsheet -- Enzyme Inhibition Constant Data from BindingDB
Found 2 hits for monomerid = 50040931
Trg + Lig
Ki
nM
ΔG°
kcal/mole
IC50
nM
Kd
nM
EC50/IC50
nM
koff
s-1
kon
M-1s-1
pHTemp
°C
Epidermal growth factor receptor
(Homo sapiens (Human))
BDBM50040931
(4,5-Bis-(4-fluoro-phenylamino)-phthalic acid dimet...)
Show SMILES COC(=O)c1cc(Nc2ccc(F)cc2)c(Nc2ccc(F)cc2)cc1C(=O)OC
Show InChI InChI=1S/C22H18F2N2O4/c1-29-21(27)17-11-19(25-15-7-3-13(23)4-8-15)20(12-18(17)22(28)30-2)26-16-9-5-14(24)6-10-16/h3-12,25-26H,1-2H3
n/an/a>1.00E+5n/an/an/an/an/an/a
Ciba-Geigy Limited
Curated by ChEMBL
Assay Description
Inhibitory activity against recombinant tyrosine kinase EGF-R (EGF-R ICD)
J Med Chem 37: 1015-27 (1994)
BindingDB Entry DOI: 10.7270/Q2M32TTP
Cyclic AMP-dependent protein kinase (PKA)
(Oryctolagus cuniculus (Rabbit))
BDBM50040931
(4,5-Bis-(4-fluoro-phenylamino)-phthalic acid dimet...)
Show SMILES COC(=O)c1cc(Nc2ccc(F)cc2)c(Nc2ccc(F)cc2)cc1C(=O)OC
Show InChI InChI=1S/C22H18F2N2O4/c1-29-21(27)17-11-19(25-15-7-3-13(23)4-8-15)20(12-18(17)22(28)30-2)26-16-9-5-14(24)6-10-16/h3-12,25-26H,1-2H3
n/an/a>5.00E+5n/an/an/an/an/an/a
Ciba-Geigy Limited
Curated by ChEMBL
Assay Description
Inhibitory activity was determined against protein kinase A (PKA) of rabbit
J Med Chem 37: 1015-27 (1994)
BindingDB Entry DOI: 10.7270/Q2M32TTP