BDBM50040962 CHEMBL3354940
SMILES: [H][C@]12C[C@@]1([H])c1c(C2)c(nn1CCN1CCOCC1)C(=O)NC(C)(C)c1ccccc1
InChI Key: InChIKey=PNFLZQSSTUBFBH-SJLPKXTDSA-N
Data: 2 EC50
Activity Spreadsheet -- Enzyme Inhibition Constant Data from BindingDB
Found 2 hits for monomerid = 50040962
Trg + Lig
Ki
nM
ΔG°
kcal/mole
IC50
nM
Kd
nM
EC50/IC50
nM
koff
s-1
kon
M-1s-1
pHTemp
°C
Cannabinoid receptor 2
(Homo sapiens (Human))
BDBM50040962
(CHEMBL3354940)
Show SMILES [H][C@]12C[C@@]1([H])c1c(C2)c(nn1CCN1CCOCC1)C(=O)NC(C)(C)c1ccccc1 |r|
Show InChI InChI=1S/C23H30N4O2/c1-23(2,17-6-4-3-5-7-17)24-22(28)20-19-15-16-14-18(16)21(19)27(25-20)9-8-26-10-12-29-13-11-26/h3-7,16,18H,8-15H2,1-2H3,(H,24,28)/t16-,18-/m1/s1
Reactome pathway
n/an/an/an/a 2.10n/an/an/an/a
Arena Pharmaceuticals
Curated by ChEMBL
Assay Description
Agonist activity at human recombinant CB2 receptor expressed in CHOK1 cells assessed as cAMP accumulation by HTRF method
Bioorg Med Chem Lett 25: 322-6 (2014)
Article DOI: 10.1016/j.bmcl.2014.11.040
BindingDB Entry DOI: 10.7270/Q21J9CDS
Cannabinoid receptor 1
(Homo sapiens (Human))
BDBM50040962
(CHEMBL3354940)
Show SMILES [H][C@]12C[C@@]1([H])c1c(C2)c(nn1CCN1CCOCC1)C(=O)NC(C)(C)c1ccccc1 |r|
Show InChI InChI=1S/C23H30N4O2/c1-23(2,17-6-4-3-5-7-17)24-22(28)20-19-15-16-14-18(16)21(19)27(25-20)9-8-26-10-12-29-13-11-26/h3-7,16,18H,8-15H2,1-2H3,(H,24,28)/t16-,18-/m1/s1
NCI pathway
Reactome pathway
n/an/an/an/a 19n/an/an/an/a
Arena Pharmaceuticals
Curated by ChEMBL
Assay Description
Agonist activity at human recombinant CB1 receptor expressed in CHOK1 cells assessed as cAMP accumulation by HTRF method
Bioorg Med Chem Lett 25: 322-6 (2014)
Article DOI: 10.1016/j.bmcl.2014.11.040
BindingDB Entry DOI: 10.7270/Q21J9CDS