BDBM50041444 CHEMBL3357390
SMILES: CN(C)CCn1c(CC(C)(C)C)nc2cc(ccc12)S(=O)(=O)C1CN(CC(F)(F)F)C1
InChI Key: InChIKey=MSGJPCGXFLUMET-UHFFFAOYSA-N
Data: 2 EC50
Activity Spreadsheet -- Enzyme Inhibition Constant Data from BindingDB
Found 2 hits for monomerid = 50041444
Trg + Lig
Ki
nM
ΔG°
kcal/mole
IC50
nM
Kd
nM
EC50/IC50
nM
koff
s-1
kon
M-1s-1
pHTemp
°C
Cannabinoid receptor 2
(Homo sapiens (Human))
BDBM50041444
(CHEMBL3357390)
Show SMILES CN(C)CCn1c(CC(C)(C)C)nc2cc(ccc12)S(=O)(=O)C1CN(CC(F)(F)F)C1
Show InChI InChI=1S/C21H31F3N4O2S/c1-20(2,3)11-19-25-17-10-15(6-7-18(17)28(19)9-8-26(4)5)31(29,30)16-12-27(13-16)14-21(22,23)24/h6-7,10,16H,8-9,11-14H2,1-5H3
Reactome pathway
n/an/an/an/a 14n/an/an/an/a
RaQualia Pharma Inc
Curated by ChEMBL
Assay Description
Agonist activity at human CB2 receptor expressed in CHO cells assessed as inhibition of forskolin-induced cAMP production
Bioorg Med Chem Lett 25: 236-40 (2014)
Article DOI: 10.1016/j.bmcl.2014.11.062
BindingDB Entry DOI: 10.7270/Q2GM88XM
Cannabinoid receptor 1
(Homo sapiens (Human))
BDBM50041444
(CHEMBL3357390)
Show SMILES CN(C)CCn1c(CC(C)(C)C)nc2cc(ccc12)S(=O)(=O)C1CN(CC(F)(F)F)C1
Show InChI InChI=1S/C21H31F3N4O2S/c1-20(2,3)11-19-25-17-10-15(6-7-18(17)28(19)9-8-26(4)5)31(29,30)16-12-27(13-16)14-21(22,23)24/h6-7,10,16H,8-9,11-14H2,1-5H3
NCI pathway
Reactome pathway
n/an/an/an/a>2.50E+4n/an/an/an/a
RaQualia Pharma Inc
Curated by ChEMBL
Assay Description
Agonist activity at human CB1 receptor expressed in CHO cells assessed as inhibition of forskolin-induced cAMP production
Bioorg Med Chem Lett 25: 236-40 (2014)
Article DOI: 10.1016/j.bmcl.2014.11.062
BindingDB Entry DOI: 10.7270/Q2GM88XM