BDBM50041446 CHEMBL3357366
SMILES: CC(=O)N1CC(C1)S(=O)(=O)c1ccc2n(CC3CC3)c(CC(C)(C)C)nc2c1
InChI Key: InChIKey=VFNTWLNLWCSFDA-UHFFFAOYSA-N
Data: 1 EC50
Activity Spreadsheet -- Enzyme Inhibition Constant Data from BindingDB
Found 1 hit for monomerid = 50041446
Trg + Lig
Ki
nM
ΔG°
kcal/mole
IC50
nM
Kd
nM
EC50/IC50
nM
koff
s-1
kon
M-1s-1
pHTemp
°C
Cannabinoid receptor 2
(Homo sapiens (Human))
BDBM50041446
(CHEMBL3357366)
Show SMILES CC(=O)N1CC(C1)S(=O)(=O)c1ccc2n(CC3CC3)c(CC(C)(C)C)nc2c1
Show InChI InChI=1S/C21H29N3O3S/c1-14(25)23-12-17(13-23)28(26,27)16-7-8-19-18(9-16)22-20(10-21(2,3)4)24(19)11-15-5-6-15/h7-9,15,17H,5-6,10-13H2,1-4H3
Reactome pathway
n/an/an/an/a 9.60n/an/an/an/a
RaQualia Pharma Inc
Curated by ChEMBL
Assay Description
Agonist activity at human CB2 receptor expressed in CHO cells assessed as inhibition of forskolin-induced cAMP production
Bioorg Med Chem Lett 25: 236-40 (2014)
Article DOI: 10.1016/j.bmcl.2014.11.062
BindingDB Entry DOI: 10.7270/Q2GM88XM