BDBM50041454 CHEMBL3357375
SMILES: CC(C)(C)Cc1nc2cc(ccc2n1CC1CC1)S(=O)(=O)CC1CN(C1)C(N)=O
InChI Key: InChIKey=ZWMWKFRUFQASKF-UHFFFAOYSA-N
Data: 1 EC50
Activity Spreadsheet -- Enzyme Inhibition Constant Data from BindingDB
Found 1 hit for monomerid = 50041454
Trg + Lig
Ki
nM
ΔG°
kcal/mole
IC50
nM
Kd
nM
EC50/IC50
nM
koff
s-1
kon
M-1s-1
pHTemp
°C
Cannabinoid receptor 2
(Homo sapiens (Human))
BDBM50041454
(CHEMBL3357375)
Show SMILES CC(C)(C)Cc1nc2cc(ccc2n1CC1CC1)S(=O)(=O)CC1CN(C1)C(N)=O
Show InChI InChI=1S/C21H30N4O3S/c1-21(2,3)9-19-23-17-8-16(6-7-18(17)25(19)12-14-4-5-14)29(27,28)13-15-10-24(11-15)20(22)26/h6-8,14-15H,4-5,9-13H2,1-3H3,(H2,22,26)
Reactome pathway
n/an/an/an/a 13n/an/an/an/a
RaQualia Pharma Inc
Curated by ChEMBL
Assay Description
Agonist activity at human CB2 receptor expressed in CHO cells assessed as inhibition of forskolin-induced cAMP production
Bioorg Med Chem Lett 25: 236-40 (2014)
Article DOI: 10.1016/j.bmcl.2014.11.062
BindingDB Entry DOI: 10.7270/Q2GM88XM