BDBM50041561 CHEMBL3358422
SMILES: ONC(=O)[C@H](Cc1ccccc1)NC(=O)OCc1ccccc1
InChI Key: InChIKey=UKGDHYIOCFNBIP-HNNXBMFYSA-N
Data: 1 IC50
Activity Spreadsheet -- Enzyme Inhibition Constant Data from BindingDB
Found 1 hit for monomerid = 50041561
Trg + Lig
Ki
nM
ΔG°
kcal/mole
IC50
nM
Kd
nM
EC50/IC50
nM
koff
s-1
kon
M-1s-1
pHTemp
°C
Neurokinin 1 receptor
(Homo sapiens (Human))
BDBM50041561
(CHEMBL3358422)
Show SMILES ONC(=O)[C@H](Cc1ccccc1)NC(=O)OCc1ccccc1 |r|
Show InChI InChI=1S/C17H18N2O4/c20-16(19-22)15(11-13-7-3-1-4-8-13)18-17(21)23-12-14-9-5-2-6-10-14/h1-10,15,22H,11-12H2,(H,18,21)(H,19,20)/t15-/m0/s1
Reactome pathway
n/an/a 4.20n/an/an/an/an/an/a
Uppsala University
Curated by ChEMBL
Assay Description
Displacement of [3H]-SP1-7 from NK1 receptor (unknown origin) by scintillation counting analysis
ACS Med Chem Lett 5: 1272-7 (2014)
Article DOI: 10.1021/ml5002954
BindingDB Entry DOI: 10.7270/Q2Q52R7V