null
SMILES: C[C@H](N1C[C@@H](C)[C@@H](CN(C)C(=O)Nc2ccc(cc2)C(F)(F)F)Oc2c(NS(=O)(=O)CCc3ccccc3)cccc2C1=O)C(O)=O
InChI Key: InChIKey=SDEVJNSKKKLWGT-PBDKAQRYSA-N
Activity Spreadsheet -- Enzyme Inhibition Constant Data from BindingDB
Found 1 hit for monomerid = 50041678
Trg + Lig
Ki
nM
ΔG°
kcal/mole
IC50
nM
Kd
nM
EC50/IC50
nM
koff
s-1
kon
M-1s-1
pHTemp
°C
Induced myeloid leukemia cell differentiation protein Mcl-1
(Homo sapiens (Human))
BDBM50041678
(CHEMBL3358903)
Show SMILES C[C@H](N1C[C@@H](C)[C@@H](CN(C)C(=O)Nc2ccc(cc2)C(F)(F)F)Oc2c(NS(=O)(=O)CCc3ccccc3)cccc2C1=O)C(O)=O |r|
Show InChI InChI=1S/C32H35F3N4O7S/c1-20-18-39(21(2)30(41)42)29(40)25-10-7-11-26(37-47(44,45)17-16-22-8-5-4-6-9-22)28(25)46-27(20)19-38(3)31(43)36-24-14-12-23(13-15-24)32(33,34)35/h4-15,20-21,27,37H,16-19H2,1-3H3,(H,36,43)(H,41,42)/t20-,21+,27-/m1/s1
NCI pathway
n/an/a>5.00E+4n/an/an/an/an/an/a
Institute
Curated by ChEMBL
Assay Description
Binding affinity to human MCL1 (173 to 329 aa) using TAMRA-labeled Noxa peptide preincubated for 30 mins by fluorescent polarization assay
ACS Med Chem Lett 5: 1308-12 (2014)
Article DOI: 10.1021/ml500388q
BindingDB Entry DOI: 10.7270/Q2FN17VP