null
SMILES: C[C@H](N1C[C@@H](C)[C@@H](CN(C)C(=O)Nc2ccccc2C(F)(F)F)Oc2c(NS(=O)(=O)c3ccc(F)cc3)cccc2C1=O)C(O)=O
InChI Key: InChIKey=XMYJUZZHKNADLY-FUMQJTLXSA-N
Activity Spreadsheet -- Enzyme Inhibition Constant Data from BindingDB
Found 1 hit for monomerid = 50041681
Trg + Lig
Ki
nM
ΔG°
kcal/mole
IC50
nM
Kd
nM
EC50/IC50
nM
koff
s-1
kon
M-1s-1
pHTemp
°C
Induced myeloid leukemia cell differentiation protein Mcl-1
(Homo sapiens (Human))
BDBM50041681
(CHEMBL3358894)
Show SMILES C[C@H](N1C[C@@H](C)[C@@H](CN(C)C(=O)Nc2ccccc2C(F)(F)F)Oc2c(NS(=O)(=O)c3ccc(F)cc3)cccc2C1=O)C(O)=O |r|
Show InChI InChI=1S/C30H30F4N4O7S/c1-17-15-38(18(2)28(40)41)27(39)21-7-6-10-24(36-46(43,44)20-13-11-19(31)12-14-20)26(21)45-25(17)16-37(3)29(42)35-23-9-5-4-8-22(23)30(32,33)34/h4-14,17-18,25,36H,15-16H2,1-3H3,(H,35,42)(H,40,41)/t17-,18+,25-/m1/s1
NCI pathway
n/an/a>5.00E+4n/an/an/an/an/an/a
Institute
Curated by ChEMBL
Assay Description
Binding affinity to human MCL1 (173 to 329 aa) using TAMRA-labeled Noxa peptide preincubated for 30 mins by fluorescent polarization assay
ACS Med Chem Lett 5: 1308-12 (2014)
Article DOI: 10.1021/ml500388q
BindingDB Entry DOI: 10.7270/Q2FN17VP