BDBM50041820 CHEMBL3358948
SMILES: Cc1ccc(c(c1)C(N)=O)C(C)(C)CC(O)(Cc1cc2cc(ncc2[nH]1)S(C)(=O)=O)C(F)(F)F
InChI Key:
Data: 5 IC50
Activity Spreadsheet -- Enzyme Inhibition Constant Data from BindingDB
Found 5 hits for monomerid = 50041820
Trg + Lig
Ki
nM
ΔG°
kcal/mole
IC50
nM
Kd
nM
EC50/IC50
nM
koff
s-1
kon
M-1s-1
pHTemp
°C
Glucocorticoid receptor
(Homo sapiens (Human))
BDBM50041820
(CHEMBL3358948)
Show SMILES Cc1ccc(c(c1)C(N)=O)C(C)(C)CC(O)(Cc1cc2cc(ncc2[nH]1)S(C)(=O)=O)C(F)(F)F
n/an/a 45n/an/an/an/an/an/a
Boehringer Ingelheim Pharmaceuticals
Curated by ChEMBL
Assay Description
Agonist activity at GR in HFF cells assessed as suppression of IL-1-induced IL-6 production
ACS Med Chem Lett 5: 1318-23 (2014)
Article DOI: 10.1021/ml500387y
BindingDB Entry DOI: 10.7270/Q2639RCZ
Glucocorticoid receptor
(Homo sapiens (Human))
BDBM50041820
(CHEMBL3358948)
Show SMILES Cc1ccc(c(c1)C(N)=O)C(C)(C)CC(O)(Cc1cc2cc(ncc2[nH]1)S(C)(=O)=O)C(F)(F)F
n/an/a 110n/an/an/an/an/an/a
Boehringer Ingelheim Pharmaceuticals
Curated by ChEMBL
Assay Description
Displacement of RU-486 from GR (unknown origin) by fluorescence polarization assay
ACS Med Chem Lett 5: 1318-23 (2014)
Article DOI: 10.1021/ml500387y
BindingDB Entry DOI: 10.7270/Q2639RCZ
Mineralocorticoid receptor
(Homo sapiens (Human))
BDBM50041820
(CHEMBL3358948)
Show SMILES Cc1ccc(c(c1)C(N)=O)C(C)(C)CC(O)(Cc1cc2cc(ncc2[nH]1)S(C)(=O)=O)C(F)(F)F
n/an/a>2.00E+3n/an/an/an/an/an/a
Boehringer Ingelheim Pharmaceuticals
Curated by ChEMBL
Assay Description
Displacement of RU-486 from MR (unknown origin) by fluorescence polarization assay
ACS Med Chem Lett 5: 1318-23 (2014)
Article DOI: 10.1021/ml500387y
BindingDB Entry DOI: 10.7270/Q2639RCZ
Cytochrome P450 3A4
(Homo sapiens (Human))
BDBM50041820
(CHEMBL3358948)
Show SMILES Cc1ccc(c(c1)C(N)=O)C(C)(C)CC(O)(Cc1cc2cc(ncc2[nH]1)S(C)(=O)=O)C(F)(F)F
Reactome pathway
n/an/a 6.00E+3n/an/an/an/an/an/a
Boehringer Ingelheim Pharmaceuticals
Curated by ChEMBL
Assay Description
Inhibition of human recombinant CYP3A4 using 7-benzyloxy-4-(trifluoromethyl)-coumarin as substrate after 30 mins by fluorescence assay
ACS Med Chem Lett 5: 1318-23 (2014)
Article DOI: 10.1021/ml500387y
BindingDB Entry DOI: 10.7270/Q2639RCZ
Progesterone receptor
(Homo sapiens (Human))
BDBM50041820
(CHEMBL3358948)
Show SMILES Cc1ccc(c(c1)C(N)=O)C(C)(C)CC(O)(Cc1cc2cc(ncc2[nH]1)S(C)(=O)=O)C(F)(F)F
n/an/a>2.00E+3n/an/an/an/an/an/a
Boehringer Ingelheim Pharmaceuticals
Curated by ChEMBL
Assay Description
Displacement of tetramethylrhodamine-labeled dexamethasone from PR (unknown origin) by fluorescence polarization assay
ACS Med Chem Lett 5: 1318-23 (2014)
Article DOI: 10.1021/ml500387y
BindingDB Entry DOI: 10.7270/Q2639RCZ