null
SMILES: CCS(=O)(=O)c1cc2cc(CC(O)(CC(C)(C)c3ccc(F)cc3C(N)=O)C(F)(F)F)[nH]c2cn1
InChI Key: InChIKey=AUIFRJWXYUNPPV-UHFFFAOYSA-N
Activity Spreadsheet -- Enzyme Inhibition Constant Data from BindingDB
Found 5 hits for monomerid = 50041890
Trg + Lig
Ki
nM
ΔG°
kcal/mole
IC50
nM
Kd
nM
EC50/IC50
nM
koff
s-1
kon
M-1s-1
pHTemp
°C
Glucocorticoid receptor
(Homo sapiens (Human))
BDBM50041890
(CHEMBL3358950)
Show SMILES CCS(=O)(=O)c1cc2cc(CC(O)(CC(C)(C)c3ccc(F)cc3C(N)=O)C(F)(F)F)[nH]c2cn1
Show InChI InChI=1S/C23H25F4N3O4S/c1-4-35(33,34)19-8-13-7-15(30-18(13)11-29-19)10-22(32,23(25,26)27)12-21(2,3)17-6-5-14(24)9-16(17)20(28)31/h5-9,11,30,32H,4,10,12H2,1-3H3,(H2,28,31)
n/an/a 46n/an/an/an/an/an/a
Boehringer Ingelheim Pharmaceuticals
Curated by ChEMBL
Assay Description
Agonist activity at GR in HFF cells assessed as suppression of IL-1-induced IL-6 production
ACS Med Chem Lett 5: 1318-23 (2014)
Article DOI: 10.1021/ml500387y
BindingDB Entry DOI: 10.7270/Q2639RCZ
Glucocorticoid receptor
(Homo sapiens (Human))
BDBM50041890
(CHEMBL3358950)
Show SMILES CCS(=O)(=O)c1cc2cc(CC(O)(CC(C)(C)c3ccc(F)cc3C(N)=O)C(F)(F)F)[nH]c2cn1
Show InChI InChI=1S/C23H25F4N3O4S/c1-4-35(33,34)19-8-13-7-15(30-18(13)11-29-19)10-22(32,23(25,26)27)12-21(2,3)17-6-5-14(24)9-16(17)20(28)31/h5-9,11,30,32H,4,10,12H2,1-3H3,(H2,28,31)
n/an/a 70n/an/an/an/an/an/a
Boehringer Ingelheim Pharmaceuticals
Curated by ChEMBL
Assay Description
Displacement of RU-486 from GR (unknown origin) by fluorescence polarization assay
ACS Med Chem Lett 5: 1318-23 (2014)
Article DOI: 10.1021/ml500387y
BindingDB Entry DOI: 10.7270/Q2639RCZ
Mineralocorticoid receptor
(Homo sapiens (Human))
BDBM50041890
(CHEMBL3358950)
Show SMILES CCS(=O)(=O)c1cc2cc(CC(O)(CC(C)(C)c3ccc(F)cc3C(N)=O)C(F)(F)F)[nH]c2cn1
Show InChI InChI=1S/C23H25F4N3O4S/c1-4-35(33,34)19-8-13-7-15(30-18(13)11-29-19)10-22(32,23(25,26)27)12-21(2,3)17-6-5-14(24)9-16(17)20(28)31/h5-9,11,30,32H,4,10,12H2,1-3H3,(H2,28,31)
n/an/a>2.00E+3n/an/an/an/an/an/a
Boehringer Ingelheim Pharmaceuticals
Curated by ChEMBL
Assay Description
Displacement of RU-486 from MR (unknown origin) by fluorescence polarization assay
ACS Med Chem Lett 5: 1318-23 (2014)
Article DOI: 10.1021/ml500387y
BindingDB Entry DOI: 10.7270/Q2639RCZ
Cytochrome P450 3A4
(Homo sapiens (Human))
BDBM50041890
(CHEMBL3358950)
Show SMILES CCS(=O)(=O)c1cc2cc(CC(O)(CC(C)(C)c3ccc(F)cc3C(N)=O)C(F)(F)F)[nH]c2cn1
Show InChI InChI=1S/C23H25F4N3O4S/c1-4-35(33,34)19-8-13-7-15(30-18(13)11-29-19)10-22(32,23(25,26)27)12-21(2,3)17-6-5-14(24)9-16(17)20(28)31/h5-9,11,30,32H,4,10,12H2,1-3H3,(H2,28,31)
Reactome pathway
n/an/a 2.60E+4n/an/an/an/an/an/a
Boehringer Ingelheim Pharmaceuticals
Curated by ChEMBL
Assay Description
Inhibition of human recombinant CYP3A4 using 7-benzyloxy-4-(trifluoromethyl)-coumarin as substrate after 30 mins by fluorescence assay
ACS Med Chem Lett 5: 1318-23 (2014)
Article DOI: 10.1021/ml500387y
BindingDB Entry DOI: 10.7270/Q2639RCZ
Progesterone receptor
(Homo sapiens (Human))
BDBM50041890
(CHEMBL3358950)
Show SMILES CCS(=O)(=O)c1cc2cc(CC(O)(CC(C)(C)c3ccc(F)cc3C(N)=O)C(F)(F)F)[nH]c2cn1
Show InChI InChI=1S/C23H25F4N3O4S/c1-4-35(33,34)19-8-13-7-15(30-18(13)11-29-19)10-22(32,23(25,26)27)12-21(2,3)17-6-5-14(24)9-16(17)20(28)31/h5-9,11,30,32H,4,10,12H2,1-3H3,(H2,28,31)
n/an/a>2.00E+3n/an/an/an/an/an/a
Boehringer Ingelheim Pharmaceuticals
Curated by ChEMBL
Assay Description
Displacement of tetramethylrhodamine-labeled dexamethasone from PR (unknown origin) by fluorescence polarization assay
ACS Med Chem Lett 5: 1318-23 (2014)
Article DOI: 10.1021/ml500387y
BindingDB Entry DOI: 10.7270/Q2639RCZ