BDBM50041943 6-(2,5-Dimethoxy-benzyl)-5-methyl-thieno[2,3-d]pyrimidine-2,4-diamine::6-(2,5-dimethoxybenzyl)-5-methylthieno[2,3-d]pyrimidine-2,4-diamine::CHEMBL104787
SMILES: COc1ccc(OC)c(Cc2sc3nc(N)nc(N)c3c2C)c1
InChI Key: InChIKey=WVIZZYJRTWDOHO-UHFFFAOYSA-N
Data: 5 IC50
Activity Spreadsheet -- Enzyme Inhibition Constant Data from BindingDB
Found 5 hits for monomerid = 50041943
Trg + Lig
Ki
nM
ΔG°
kcal/mole
IC50
nM
Kd
nM
EC50/IC50
nM
koff
s-1
kon
M-1s-1
pHTemp
°C
Dihydrofolate Reductase (DHFR)
(Escherichia coli)
BDBM50041943
(6-(2,5-Dimethoxy-benzyl)-5-methyl-thieno[2,3-d]pyr...)
Show SMILES COc1ccc(OC)c(Cc2sc3nc(N)nc(N)c3c2C)c1
Show InChI InChI=1S/C16H18N4O2S/c1-8-12(23-15-13(8)14(17)19-16(18)20-15)7-9-6-10(21-2)4-5-11(9)22-3/h4-6H,7H2,1-3H3,(H4,17,18,19,20)
n/an/a 70n/an/an/an/an/an/a
Harvard Medical School
Curated by ChEMBL
Assay Description
Inhibition of dihydrofolate reductase in Toxoplasma gondii.
J Med Chem 36: 3103-12 (1993)
BindingDB Entry DOI: 10.7270/Q23X85PX
Dihydrofolate reductase
(Homo sapiens (Human))
BDBM50041943
(6-(2,5-Dimethoxy-benzyl)-5-methyl-thieno[2,3-d]pyr...)
Show SMILES COc1ccc(OC)c(Cc2sc3nc(N)nc(N)c3c2C)c1
Show InChI InChI=1S/C16H18N4O2S/c1-8-12(23-15-13(8)14(17)19-16(18)20-15)7-9-6-10(21-2)4-5-11(9)22-3/h4-6H,7H2,1-3H3,(H4,17,18,19,20)
NCI pathway
Reactome pathway
n/an/a 730n/an/an/an/an/an/a
Harvard Medical School
Curated by ChEMBL
Assay Description
Tested for inhibitory activity against dihydrofolate reductase in human
J Med Chem 36: 3103-12 (1993)
BindingDB Entry DOI: 10.7270/Q23X85PX
Bacterial dihydrofolate reductase
(Escherichia coli)
BDBM50041943
(6-(2,5-Dimethoxy-benzyl)-5-methyl-thieno[2,3-d]pyr...)
Show SMILES COc1ccc(OC)c(Cc2sc3nc(N)nc(N)c3c2C)c1
Show InChI InChI=1S/C16H18N4O2S/c1-8-12(23-15-13(8)14(17)19-16(18)20-15)7-9-6-10(21-2)4-5-11(9)22-3/h4-6H,7H2,1-3H3,(H4,17,18,19,20)
n/an/a 1.40E+4n/an/an/an/an/an/a
Harvard Medical School
Curated by ChEMBL
Assay Description
Tested for inhibitory activity against dihydrofolate reductase in Beef liver
J Med Chem 36: 3103-12 (1993)
BindingDB Entry DOI: 10.7270/Q23X85PX
Dihydrofolate reductase (DHFR)
(Toxoplasma gondii)
BDBM50041943
(6-(2,5-Dimethoxy-benzyl)-5-methyl-thieno[2,3-d]pyr...)
Show SMILES COc1ccc(OC)c(Cc2sc3nc(N)nc(N)c3c2C)c1
Show InChI InChI=1S/C16H18N4O2S/c1-8-12(23-15-13(8)14(17)19-16(18)20-15)7-9-6-10(21-2)4-5-11(9)22-3/h4-6H,7H2,1-3H3,(H4,17,18,19,20)
n/an/a 70n/an/an/an/an/an/a
Duquesne University
Curated by ChEMBL
Assay Description
Inhibition of Toxoplasma gondii dihydrofolate reductase
J Med Chem 51: 4589-600 (2008)
Article DOI: 10.1021/jm800244v
BindingDB Entry DOI: 10.7270/Q2ZW1MTV
Dihydrofolate reductase
(Rattus norvegicus (rat))
BDBM50041943
(6-(2,5-Dimethoxy-benzyl)-5-methyl-thieno[2,3-d]pyr...)
Show SMILES COc1ccc(OC)c(Cc2sc3nc(N)nc(N)c3c2C)c1
Show InChI InChI=1S/C16H18N4O2S/c1-8-12(23-15-13(8)14(17)19-16(18)20-15)7-9-6-10(21-2)4-5-11(9)22-3/h4-6H,7H2,1-3H3,(H4,17,18,19,20)
Reactome pathway
n/an/a 400n/an/an/an/an/an/a
Harvard Medical School
Curated by ChEMBL
Assay Description
Inhibition of rat liver dihydrofolate reductase.
J Med Chem 36: 3103-12 (1993)
BindingDB Entry DOI: 10.7270/Q23X85PX