null
SMILES: CC(C)(CC(O)(Cc1cc2cc(ncc2[nH]1)N1CCOCC1)C(F)(F)F)c1cccc(O)c1
InChI Key:
Activity Spreadsheet -- Enzyme Inhibition Constant Data from BindingDB
Found 5 hits for monomerid = 50041971
Trg + Lig
Ki
nM
ΔG°
kcal/mole
IC50
nM
Kd
nM
EC50/IC50
nM
koff
s-1
kon
M-1s-1
pHTemp
°C
Glucocorticoid receptor
(Homo sapiens (Human))
BDBM50041971
(CHEMBL3358936)
Show SMILES CC(C)(CC(O)(Cc1cc2cc(ncc2[nH]1)N1CCOCC1)C(F)(F)F)c1cccc(O)c1
n/an/a 24n/an/an/an/an/an/a
Boehringer Ingelheim Pharmaceuticals
Curated by ChEMBL
Assay Description
Displacement of RU-486 from GR (unknown origin) by fluorescence polarization assay
ACS Med Chem Lett 5: 1318-23 (2014)
Article DOI: 10.1021/ml500387y
BindingDB Entry DOI: 10.7270/Q2639RCZ
Progesterone receptor
(Homo sapiens (Human))
BDBM50041971
(CHEMBL3358936)
Show SMILES CC(C)(CC(O)(Cc1cc2cc(ncc2[nH]1)N1CCOCC1)C(F)(F)F)c1cccc(O)c1
n/an/a>2.00E+3n/an/an/an/an/an/a
Boehringer Ingelheim Pharmaceuticals
Curated by ChEMBL
Assay Description
Displacement of tetramethylrhodamine-labeled dexamethasone from PR (unknown origin) by fluorescence polarization assay
ACS Med Chem Lett 5: 1318-23 (2014)
Article DOI: 10.1021/ml500387y
BindingDB Entry DOI: 10.7270/Q2639RCZ
Mineralocorticoid receptor
(Homo sapiens (Human))
BDBM50041971
(CHEMBL3358936)
Show SMILES CC(C)(CC(O)(Cc1cc2cc(ncc2[nH]1)N1CCOCC1)C(F)(F)F)c1cccc(O)c1
n/an/a>2.00E+3n/an/an/an/an/an/a
Boehringer Ingelheim Pharmaceuticals
Curated by ChEMBL
Assay Description
Displacement of RU-486 from MR (unknown origin) by fluorescence polarization assay
ACS Med Chem Lett 5: 1318-23 (2014)
Article DOI: 10.1021/ml500387y
BindingDB Entry DOI: 10.7270/Q2639RCZ
Cytochrome P450 3A4
(Homo sapiens (Human))
BDBM50041971
(CHEMBL3358936)
Show SMILES CC(C)(CC(O)(Cc1cc2cc(ncc2[nH]1)N1CCOCC1)C(F)(F)F)c1cccc(O)c1
Reactome pathway
n/an/a 4.00E+3n/an/an/an/an/an/a
Boehringer Ingelheim Pharmaceuticals
Curated by ChEMBL
Assay Description
Inhibition of human recombinant CYP3A4 using 7-benzyloxy-4-(trifluoromethyl)-coumarin as substrate after 30 mins by fluorescence assay
ACS Med Chem Lett 5: 1318-23 (2014)
Article DOI: 10.1021/ml500387y
BindingDB Entry DOI: 10.7270/Q2639RCZ
Glucocorticoid receptor
(Homo sapiens (Human))
BDBM50041971
(CHEMBL3358936)
Show SMILES CC(C)(CC(O)(Cc1cc2cc(ncc2[nH]1)N1CCOCC1)C(F)(F)F)c1cccc(O)c1
n/an/a 53n/an/an/an/an/an/a
Boehringer Ingelheim Pharmaceuticals
Curated by ChEMBL
Assay Description
Agonist activity at GR in HFF cells assessed as suppression of IL-1-induced IL-6 production
ACS Med Chem Lett 5: 1318-23 (2014)
Article DOI: 10.1021/ml500387y
BindingDB Entry DOI: 10.7270/Q2639RCZ