BDBM50042385 3-(2-Benzyloxycarbonylamino-4-methyl-pentanoylamino)-2-oxo-4-phenyl-butyric acid ethyl ester::CHEMBL411658
SMILES: CCOC(=O)C(=O)C(Cc1ccccc1)NC(=O)C(CC(C)C)NC(=O)OCc1ccccc1
InChI Key: InChIKey=HXBBAHFTXYKHGX-UHFFFAOYSA-N
Data: 4 KI
Activity Spreadsheet -- Enzyme Inhibition Constant Data from BindingDB
Found 4 hits for monomerid = 50042385
Trg + Lig
Ki
nM
ΔG°
kcal/mole
IC50
nM
Kd
nM
EC50/IC50
nM
koff
s-1
kon
M-1s-1
pHTemp
°C
Calpain-2 (m-Calpain)
(Homo sapiens (Human))
BDBM50042385
(3-(2-Benzyloxycarbonylamino-4-methyl-pentanoylamin...)
Show SMILES CCOC(=O)C(=O)C(Cc1ccccc1)NC(=O)C(CC(C)C)NC(=O)OCc1ccccc1
Show InChI InChI=1S/C26H32N2O6/c1-4-33-25(31)23(29)21(16-19-11-7-5-8-12-19)27-24(30)22(15-18(2)3)28-26(32)34-17-20-13-9-6-10-14-20/h5-14,18,21-22H,4,15-17H2,1-3H3,(H,27,30)(H,28,32)
400n/an/an/an/an/an/a8.0n/a
School of Chemistry and Biochemistry
Curated by ChEMBL
Assay Description
Inhibitory activity of alpha-keto esters towards calpain 2 at pH 8.0
J Med Chem 36: 3472-80 (1993)
BindingDB Entry DOI: 10.7270/Q2F76BK3
Calpain 1/small subunit 1
(Homo sapiens (Human))
BDBM50042385
(3-(2-Benzyloxycarbonylamino-4-methyl-pentanoylamin...)
Show SMILES CCOC(=O)C(=O)C(Cc1ccccc1)NC(=O)C(CC(C)C)NC(=O)OCc1ccccc1
Show InChI InChI=1S/C26H32N2O6/c1-4-33-25(31)23(29)21(16-19-11-7-5-8-12-19)27-24(30)22(15-18(2)3)28-26(32)34-17-20-13-9-6-10-14-20/h5-14,18,21-22H,4,15-17H2,1-3H3,(H,27,30)(H,28,32)
Reactome pathway
1.80E+3n/an/an/an/an/an/an/an/a
School of Chemistry and Biochemistry
Curated by ChEMBL
Assay Description
Inhibitory activity of alpha-keto esters towards calpain 1 at pH 8.0.
J Med Chem 36: 3472-80 (1993)
BindingDB Entry DOI: 10.7270/Q2F76BK3
Papain
(Carica papaya)
BDBM50042385
(3-(2-Benzyloxycarbonylamino-4-methyl-pentanoylamin...)
Show SMILES CCOC(=O)C(=O)C(Cc1ccccc1)NC(=O)C(CC(C)C)NC(=O)OCc1ccccc1
Show InChI InChI=1S/C26H32N2O6/c1-4-33-25(31)23(29)21(16-19-11-7-5-8-12-19)27-24(30)22(15-18(2)3)28-26(32)34-17-20-13-9-6-10-14-20/h5-14,18,21-22H,4,15-17H2,1-3H3,(H,27,30)(H,28,32)
7.50E+4n/an/an/an/an/an/a6.0n/a
School of Chemistry and Biochemistry
Curated by ChEMBL
Assay Description
Inhibitory activity of alpha-ketoesters towards papain at pH 6.0
J Med Chem 36: 3472-80 (1993)
BindingDB Entry DOI: 10.7270/Q2F76BK3
Cathepsin B
(Bos taurus (bovine))
BDBM50042385
(3-(2-Benzyloxycarbonylamino-4-methyl-pentanoylamin...)
Show SMILES CCOC(=O)C(=O)C(Cc1ccccc1)NC(=O)C(CC(C)C)NC(=O)OCc1ccccc1
Show InChI InChI=1S/C26H32N2O6/c1-4-33-25(31)23(29)21(16-19-11-7-5-8-12-19)27-24(30)22(15-18(2)3)28-26(32)34-17-20-13-9-6-10-14-20/h5-14,18,21-22H,4,15-17H2,1-3H3,(H,27,30)(H,28,32)
Reactome pathway
3.40E+5n/an/an/an/an/an/a5.2n/a
School of Chemistry and Biochemistry
Curated by ChEMBL
Assay Description
Inhibition of alpha-keto esters towards cathepsin B at pH 5.2
J Med Chem 36: 3472-80 (1993)
BindingDB Entry DOI: 10.7270/Q2F76BK3