BDBM50042544 5-Butyl-2-(2-nitro-phenyl)-4-[2'-(1H-tetrazol-5-yl)-biphenyl-4-ylmethyl]-2H-pyrazole-3-carboxylic acid::CHEMBL93547
SMILES: CCCCc1nn(c(C(O)=O)c1Cc1ccc(cc1)-c1ccccc1-c1nnn[nH]1)-c1ccccc1[N+]([O-])=O
InChI Key: InChIKey=QBAIFEHUMQOWLP-UHFFFAOYSA-N
Data: 1 KI  3 IC50
Activity Spreadsheet -- Enzyme Inhibition Constant Data from BindingDB
Found 4 hits for monomerid = 50042544
Trg + Lig
Ki
nM
ΔG°
kcal/mole
IC50
nM
Kd
nM
EC50/IC50
nM
koff
s-1
kon
M-1s-1
pHTemp
°C
Renal dipeptidase
(GUINEA PIG)
BDBM50042544
(5-Butyl-2-(2-nitro-phenyl)-4-[2'-(1H-tetrazol-5-yl...)
Show SMILES CCCCc1nn(c(C(O)=O)c1Cc1ccc(cc1)-c1ccccc1-c1nnn[nH]1)-c1ccccc1[N+]([O-])=O
Show InChI InChI=1S/C28H25N7O4/c1-2-3-10-23-22(26(28(36)37)34(31-23)24-11-6-7-12-25(24)35(38)39)17-18-13-15-19(16-14-18)20-8-4-5-9-21(20)27-29-32-33-30-27/h4-9,11-16H,2-3,10,17H2,1H3,(H,36,37)(H,29,30,32,33)
6.40E+5n/an/an/an/an/an/an/an/a
Merck Research Laboratories
Curated by ChEMBL
Assay Description
In vitro apparent inhibition constant of porcine renal Dehydropeptidase-1.
Bioorg Med Chem Lett 9: 2741-6 (1999)
BindingDB Entry DOI: 10.7270/Q24Q7T6C
Angiotensin II type 1a (AT-1a) receptor
(RABBIT)
BDBM50042544
(5-Butyl-2-(2-nitro-phenyl)-4-[2'-(1H-tetrazol-5-yl...)
Show SMILES CCCCc1nn(c(C(O)=O)c1Cc1ccc(cc1)-c1ccccc1-c1nnn[nH]1)-c1ccccc1[N+]([O-])=O
Show InChI InChI=1S/C28H25N7O4/c1-2-3-10-23-22(26(28(36)37)34(31-23)24-11-6-7-12-25(24)35(38)39)17-18-13-15-19(16-14-18)20-8-4-5-9-21(20)27-29-32-33-30-27/h4-9,11-16H,2-3,10,17H2,1H3,(H,36,37)(H,29,30,32,33)
n/an/a 1.70n/an/an/an/an/an/a
Merck Research Laboratories
Curated by ChEMBL
Assay Description
Evaluation of Angiotensin II antagonistic activity by displacement of [125I]-Sar Ile-AII at the rabbit aorta Angiotensin II receptor, type 1
J Med Chem 36: 3595-605 (1994)
BindingDB Entry DOI: 10.7270/Q25Q4V5H
Beta-lactamase type II
(Bacteroides fragilis)
BDBM50042544
(5-Butyl-2-(2-nitro-phenyl)-4-[2'-(1H-tetrazol-5-yl...)
Show SMILES CCCCc1nn(c(C(O)=O)c1Cc1ccc(cc1)-c1ccccc1-c1nnn[nH]1)-c1ccccc1[N+]([O-])=O
Show InChI InChI=1S/C28H25N7O4/c1-2-3-10-23-22(26(28(36)37)34(31-23)24-11-6-7-12-25(24)35(38)39)17-18-13-15-19(16-14-18)20-8-4-5-9-21(20)27-29-32-33-30-27/h4-9,11-16H,2-3,10,17H2,1H3,(H,36,37)(H,29,30,32,33)
NCI pathway
Reactome pathway
n/an/a 1.20E+5n/an/an/an/an/an/a
Merck Research Laboratories
Curated by ChEMBL
Assay Description
Inhibition of metallo-beta-lactamase (MBL) from Bacteroides fragilis.
Bioorg Med Chem Lett 9: 2741-6 (1999)
BindingDB Entry DOI: 10.7270/Q24Q7T6C
metallo-beta-lactamase IMP-1
(Pseudomonas aeruginosa)
BDBM50042544
(5-Butyl-2-(2-nitro-phenyl)-4-[2'-(1H-tetrazol-5-yl...)
Show SMILES CCCCc1nn(c(C(O)=O)c1Cc1ccc(cc1)-c1ccccc1-c1nnn[nH]1)-c1ccccc1[N+]([O-])=O
Show InChI InChI=1S/C28H25N7O4/c1-2-3-10-23-22(26(28(36)37)34(31-23)24-11-6-7-12-25(24)35(38)39)17-18-13-15-19(16-14-18)20-8-4-5-9-21(20)27-29-32-33-30-27/h4-9,11-16H,2-3,10,17H2,1H3,(H,36,37)(H,29,30,32,33)
n/an/a>2.00E+5n/an/an/an/an/an/a
Merck Research Laboratories
Curated by ChEMBL
Assay Description
Inhibition of metallo-beta-lactamase (MBL) from Pseudomonas aeruginosa mediated by the plasmid-borne IMP-1 enzyme.
Bioorg Med Chem Lett 9: 2741-6 (1999)
BindingDB Entry DOI: 10.7270/Q24Q7T6C