BDBM50042564 5-Butyl-2-(4-chloro-phenyl)-4-[2'-(1H-tetrazol-5-yl)-biphenyl-4-ylmethyl]-2H-pyrazole-3-carboxylic acid ethyl ester::CHEMBL91287
SMILES: CCCCc1nn(c(C(=O)OCC)c1Cc1ccc(cc1)-c1ccccc1-c1nnn[nH]1)-c1ccc(Cl)cc1
InChI Key: InChIKey=KBWXCDNLLSZCIW-UHFFFAOYSA-N
Data: 1 KI  3 IC50
Activity Spreadsheet -- Enzyme Inhibition Constant Data from BindingDB
Found 4 hits for monomerid = 50042564
Trg + Lig
Ki
nM
ΔG°
kcal/mole
IC50
nM
Kd
nM
EC50/IC50
nM
koff
s-1
kon
M-1s-1
pHTemp
°C
Renal dipeptidase
(GUINEA PIG)
BDBM50042564
(5-Butyl-2-(4-chloro-phenyl)-4-[2'-(1H-tetrazol-5-y...)
Show SMILES CCCCc1nn(c(C(=O)OCC)c1Cc1ccc(cc1)-c1ccccc1-c1nnn[nH]1)-c1ccc(Cl)cc1
Show InChI InChI=1S/C30H29ClN6O2/c1-3-5-10-27-26(28(30(38)39-4-2)37(34-27)23-17-15-22(31)16-18-23)19-20-11-13-21(14-12-20)24-8-6-7-9-25(24)29-32-35-36-33-29/h6-9,11-18H,3-5,10,19H2,1-2H3,(H,32,33,35,36)
3.80E+5n/an/an/an/an/an/an/an/a
Merck Research Laboratories
Curated by ChEMBL
Assay Description
In vitro apparent inhibition constant of porcine renal Dehydropeptidase-1.
Bioorg Med Chem Lett 9: 2741-6 (1999)
BindingDB Entry DOI: 10.7270/Q24Q7T6C
Angiotensin II type 1a (AT-1a) receptor
(RABBIT)
BDBM50042564
(5-Butyl-2-(4-chloro-phenyl)-4-[2'-(1H-tetrazol-5-y...)
Show SMILES CCCCc1nn(c(C(=O)OCC)c1Cc1ccc(cc1)-c1ccccc1-c1nnn[nH]1)-c1ccc(Cl)cc1
Show InChI InChI=1S/C30H29ClN6O2/c1-3-5-10-27-26(28(30(38)39-4-2)37(34-27)23-17-15-22(31)16-18-23)19-20-11-13-21(14-12-20)24-8-6-7-9-25(24)29-32-35-36-33-29/h6-9,11-18H,3-5,10,19H2,1-2H3,(H,32,33,35,36)
n/an/a 100n/an/an/an/an/an/a
Merck Research Laboratories
Curated by ChEMBL
Assay Description
Evaluation of Angiotensin II antagonistic activity by displacement of [125I]-Sar Ile-AII at the rabbit aorta Angiotensin II receptor, type 1
J Med Chem 36: 3595-605 (1994)
BindingDB Entry DOI: 10.7270/Q25Q4V5H
Beta-lactamase type II
(Bacteroides fragilis)
BDBM50042564
(5-Butyl-2-(4-chloro-phenyl)-4-[2'-(1H-tetrazol-5-y...)
Show SMILES CCCCc1nn(c(C(=O)OCC)c1Cc1ccc(cc1)-c1ccccc1-c1nnn[nH]1)-c1ccc(Cl)cc1
Show InChI InChI=1S/C30H29ClN6O2/c1-3-5-10-27-26(28(30(38)39-4-2)37(34-27)23-17-15-22(31)16-18-23)19-20-11-13-21(14-12-20)24-8-6-7-9-25(24)29-32-35-36-33-29/h6-9,11-18H,3-5,10,19H2,1-2H3,(H,32,33,35,36)
NCI pathway
Reactome pathway
n/an/a 2.90E+5n/an/an/an/an/an/a
Merck Research Laboratories
Curated by ChEMBL
Assay Description
Inhibition of metallo-beta-lactamase (MBL) from Bacteroides fragilis.
Bioorg Med Chem Lett 9: 2741-6 (1999)
BindingDB Entry DOI: 10.7270/Q24Q7T6C
metallo-beta-lactamase IMP-1
(Pseudomonas aeruginosa)
BDBM50042564
(5-Butyl-2-(4-chloro-phenyl)-4-[2'-(1H-tetrazol-5-y...)
Show SMILES CCCCc1nn(c(C(=O)OCC)c1Cc1ccc(cc1)-c1ccccc1-c1nnn[nH]1)-c1ccc(Cl)cc1
Show InChI InChI=1S/C30H29ClN6O2/c1-3-5-10-27-26(28(30(38)39-4-2)37(34-27)23-17-15-22(31)16-18-23)19-20-11-13-21(14-12-20)24-8-6-7-9-25(24)29-32-35-36-33-29/h6-9,11-18H,3-5,10,19H2,1-2H3,(H,32,33,35,36)
n/an/a 7.00E+4n/an/an/an/an/an/a
Merck Research Laboratories
Curated by ChEMBL
Assay Description
Inhibition of metallo-beta-lactamase (MBL) from Pseudomonas aeruginosa mediated by the plasmid-borne IMP-1 enzyme.
Bioorg Med Chem Lett 9: 2741-6 (1999)
BindingDB Entry DOI: 10.7270/Q24Q7T6C