BDBM50042661 CHEMBL3353871
SMILES: CC(C)(C)c1nnc(NC(=O)[C@@H]2CCCN2C2CCOCC2)s1
InChI Key: InChIKey=LUWNNDQRRBQNAS-LBPRGKRZSA-N
Data: 2 EC50
Activity Spreadsheet -- Enzyme Inhibition Constant Data from BindingDB
Found 2 hits for monomerid = 50042661
Trg + Lig
Ki
nM
ΔG°
kcal/mole
IC50
nM
Kd
nM
EC50/IC50
nM
koff
s-1
kon
M-1s-1
pHTemp
°C
Cannabinoid receptor 1
(Homo sapiens (Human))
BDBM50042661
(CHEMBL3353871)
Show SMILES CC(C)(C)c1nnc(NC(=O)[C@@H]2CCCN2C2CCOCC2)s1 |r|
Show InChI InChI=1S/C16H26N4O2S/c1-16(2,3)14-18-19-15(23-14)17-13(21)12-5-4-8-20(12)11-6-9-22-10-7-11/h11-12H,4-10H2,1-3H3,(H,17,19,21)/t12-/m0/s1
NCI pathway
Reactome pathway
n/an/an/an/a>5.00E+4n/an/an/an/a
Boehringer Ingelheim Pharma GmbH& Co. KG
Curated by ChEMBL
Assay Description
Agonist activity at human CB1 receptor expressed in CHO cells assessed as inhibition of forskolin-stimulated cAMP production after 30 mins
Bioorg Med Chem Lett 25: 581-6 (2015)
Article DOI: 10.1016/j.bmcl.2014.12.019
BindingDB Entry DOI: 10.7270/Q2CN75H1
Cannabinoid receptor 2
(Homo sapiens (Human))
BDBM50042661
(CHEMBL3353871)
Show SMILES CC(C)(C)c1nnc(NC(=O)[C@@H]2CCCN2C2CCOCC2)s1 |r|
Show InChI InChI=1S/C16H26N4O2S/c1-16(2,3)14-18-19-15(23-14)17-13(21)12-5-4-8-20(12)11-6-9-22-10-7-11/h11-12H,4-10H2,1-3H3,(H,17,19,21)/t12-/m0/s1
Reactome pathway
n/an/an/an/a 59n/an/an/an/a
Boehringer Ingelheim Pharma GmbH& Co. KG
Curated by ChEMBL
Assay Description
Agonist activity at human CB2 receptor expressed in CHO cells assessed as inhibition of forskolin-stimulated cAMP production after 30 mins
Bioorg Med Chem Lett 25: 581-6 (2015)
Article DOI: 10.1016/j.bmcl.2014.12.019
BindingDB Entry DOI: 10.7270/Q2CN75H1