BDBM50042804 2-Amino-7-(3-chloro-benzyl)-3,5-dihydro-pyrrolo[3,2-d]pyrimidin-4-one::2-amino-7-(3-chlorobenzyl)-3H-pyrrolo[3,2-d]pyrimidin-4(5H)-one::CHEMBL310364
SMILES: Nc1nc2c(Cc3cccc(Cl)c3)c[nH]c2c(=O)[nH]1
InChI Key: InChIKey=CULKYGOMWFATON-UHFFFAOYSA-N
Data: 2 KI  6 IC50
Activity Spreadsheet -- Enzyme Inhibition Constant Data from BindingDB
Found 8 hits for monomerid = 50042804
Trg + Lig
Ki
nM
ΔG°
kcal/mole
IC50
nM
Kd
nM
EC50/IC50
nM
koff
s-1
kon
M-1s-1
pHTemp
°C
Purine Nucleoside Phosphorylase (PNP)
(Bos taurus (bovine))
BDBM50042804
(2-Amino-7-(3-chloro-benzyl)-3,5-dihydro-pyrrolo[3,...)
Show SMILES Nc1nc2c(Cc3cccc(Cl)c3)c[nH]c2c(=O)[nH]1
Show InChI InChI=1S/C13H11ClN4O/c14-9-3-1-2-7(5-9)4-8-6-16-11-10(8)17-13(15)18-12(11)19/h1-3,5-6,16H,4H2,(H3,15,17,18,19)
Reactome pathway
4.30n/an/an/an/an/an/an/an/a
University of Michigan
Curated by ChEMBL
Assay Description
Inhibitory activity against calf spleen purine nucleoside phosphorylase (PNP) using 2-amino-6-mercapto-7-methyl purine ribonucleoside (MESG) as subst...
J Med Chem 42: 2422-31 (1999)
Article DOI: 10.1021/jm990037y
BindingDB Entry DOI: 10.7270/Q2CR5SKN
Purine Nucleoside Phosphorylase (PNP)
(Bos taurus (bovine))
BDBM50042804
(2-Amino-7-(3-chloro-benzyl)-3,5-dihydro-pyrrolo[3,...)
Show SMILES Nc1nc2c(Cc3cccc(Cl)c3)c[nH]c2c(=O)[nH]1
Show InChI InChI=1S/C13H11ClN4O/c14-9-3-1-2-7(5-9)4-8-6-16-11-10(8)17-13(15)18-12(11)19/h1-3,5-6,16H,4H2,(H3,15,17,18,19)
Reactome pathway
18.9n/an/an/an/an/an/an/an/a
University of Michigan
Curated by ChEMBL
Assay Description
Inhibitory activity against calf spleen purine nucleoside phosphorylase (PNP) using inosine as substrate at a concentration of 10 uM.
J Med Chem 42: 2422-31 (1999)
Article DOI: 10.1021/jm990037y
BindingDB Entry DOI: 10.7270/Q2CR5SKN
Purine Nucleoside Phosphorylase (PNP)
(Bos taurus (bovine))
BDBM50042804
(2-Amino-7-(3-chloro-benzyl)-3,5-dihydro-pyrrolo[3,...)
Show SMILES Nc1nc2c(Cc3cccc(Cl)c3)c[nH]c2c(=O)[nH]1
Show InChI InChI=1S/C13H11ClN4O/c14-9-3-1-2-7(5-9)4-8-6-16-11-10(8)17-13(15)18-12(11)19/h1-3,5-6,16H,4H2,(H3,15,17,18,19)
Reactome pathway
n/an/a 150n/an/an/an/an/an/a
BioCryst Pharmaceuticals, Inc.
Curated by ChEMBL
Assay Description
Inhibition of Purine nucleoside phosphorylase was evaluated against the enzyme from calf spleen in 50 mM phosphate
J Med Chem 36: 55-69 (1993)
BindingDB Entry DOI: 10.7270/Q2B27TCX
Purine nucleoside phosphorylase
(Bos taurus (bovine))
BDBM50042804
(2-Amino-7-(3-chloro-benzyl)-3,5-dihydro-pyrrolo[3,...)
Show SMILES Nc1nc2c(Cc3cccc(Cl)c3)c[nH]c2c(=O)[nH]1
Show InChI InChI=1S/C13H11ClN4O/c14-9-3-1-2-7(5-9)4-8-6-16-11-10(8)17-13(15)18-12(11)19/h1-3,5-6,16H,4H2,(H3,15,17,18,19)
Reactome pathway
n/an/a 20n/an/an/an/an/an/a
BioCryst Pharmaceuticals, Inc.
Curated by ChEMBL
Assay Description
Inhibition of Purine nucleoside phosphorylase was evaluated against the enzyme from calf spleen in 50 mM phosphate
J Med Chem 36: 55-69 (1993)
BindingDB Entry DOI: 10.7270/Q2B27TCX
Purine nucleoside phosphorylase
(Homo sapiens (Human))
BDBM50042804
(2-Amino-7-(3-chloro-benzyl)-3,5-dihydro-pyrrolo[3,...)
Show SMILES Nc1nc2c(Cc3cccc(Cl)c3)c[nH]c2c(=O)[nH]1
Show InChI InChI=1S/C13H11ClN4O/c14-9-3-1-2-7(5-9)4-8-6-16-11-10(8)17-13(15)18-12(11)19/h1-3,5-6,16H,4H2,(H3,15,17,18,19)
Reactome pathway
n/an/a 50n/an/an/an/an/an/a
Universidade Federal da Bahia
Curated by ChEMBL
Assay Description
Inhibition of human purine nucleoside phosphorylase
Bioorg Med Chem 18: 1421-7 (2010)
Article DOI: 10.1016/j.bmc.2010.01.022
BindingDB Entry DOI: 10.7270/Q2571C49
Purine nucleoside phosphorylase
(Homo sapiens (Human))
BDBM50042804
(2-Amino-7-(3-chloro-benzyl)-3,5-dihydro-pyrrolo[3,...)
Show SMILES Nc1nc2c(Cc3cccc(Cl)c3)c[nH]c2c(=O)[nH]1
Show InChI InChI=1S/C13H11ClN4O/c14-9-3-1-2-7(5-9)4-8-6-16-11-10(8)17-13(15)18-12(11)19/h1-3,5-6,16H,4H2,(H3,15,17,18,19)
Reactome pathway
n/an/a 20n/an/an/an/an/an/a
BioCryst Pharmaceuticals, Inc.
Curated by ChEMBL
Assay Description
Inhibition of Purine nucleoside Phosphorylase from calf spleen at 1 mM PO4
J Med Chem 36: 3771-83 (1994)
BindingDB Entry DOI: 10.7270/Q23J3DKS
Purine nucleoside phosphorylase
(Homo sapiens (Human))
BDBM50042804
(2-Amino-7-(3-chloro-benzyl)-3,5-dihydro-pyrrolo[3,...)
Show SMILES Nc1nc2c(Cc3cccc(Cl)c3)c[nH]c2c(=O)[nH]1
Show InChI InChI=1S/C13H11ClN4O/c14-9-3-1-2-7(5-9)4-8-6-16-11-10(8)17-13(15)18-12(11)19/h1-3,5-6,16H,4H2,(H3,15,17,18,19)
Reactome pathway
n/an/a 150n/an/an/an/an/an/a
BioCryst Pharmaceuticals, Inc.
Curated by ChEMBL
Assay Description
Inhibition of Purine nucleoside Phosphorylase from calf spleen at 50 mM PO4
J Med Chem 36: 3771-83 (1994)
BindingDB Entry DOI: 10.7270/Q23J3DKS
Purine Nucleoside Phosphorylase (PNP)
(Bos taurus (bovine))
BDBM50042804
(2-Amino-7-(3-chloro-benzyl)-3,5-dihydro-pyrrolo[3,...)
Show SMILES Nc1nc2c(Cc3cccc(Cl)c3)c[nH]c2c(=O)[nH]1
Show InChI InChI=1S/C13H11ClN4O/c14-9-3-1-2-7(5-9)4-8-6-16-11-10(8)17-13(15)18-12(11)19/h1-3,5-6,16H,4H2,(H3,15,17,18,19)
Reactome pathway
n/an/a 25.8n/an/an/an/an/an/a
University of Michigan
Curated by ChEMBL
Assay Description
Inhibitory activity against calf spleen purine nucleoside phosphorylase (PNP) using inosine as substrate at a concentration of 10 uM.
J Med Chem 42: 2422-31 (1999)
Article DOI: 10.1021/jm990037y
BindingDB Entry DOI: 10.7270/Q2CR5SKN