BDBM50042831 6-Amino-2-[(9-mercaptomethyl-10-oxo-azecane-2-carbonyl)-amino]-hexanoic acid; hydrochloride::CHEMBL555862
SMILES: NCCCC[C@@H](NC(=O)C1CCCCCCC(CS)C(=O)N1)C(O)=O
InChI Key: InChIKey=HEYAWAIMRFBOHJ-JXQTWKCFSA-N
Data: 1 IC50
Activity Spreadsheet -- Enzyme Inhibition Constant Data from BindingDB
Found 1 hit for monomerid = 50042831
Trg + Lig
Ki
nM
ΔG°
kcal/mole
IC50
nM
Kd
nM
EC50/IC50
nM
koff
s-1
kon
M-1s-1
pHTemp
°C
Neutral Endopeptidase (NEP)
(Rattus norvegicus (Rat))
BDBM50042831
(6-Amino-2-[(9-mercaptomethyl-10-oxo-azecane-2-carb...)
Show SMILES NCCCC[C@@H](NC(=O)C1CCCCCCC(CS)C(=O)N1)C(O)=O
Show InChI InChI=1S/C17H31N3O4S/c18-10-6-5-9-14(17(23)24)20-16(22)13-8-4-2-1-3-7-12(11-25)15(21)19-13/h12-14,25H,1-11,18H2,(H,19,21)(H,20,22)(H,23,24)/t12?,13?,14-/m1/s1
Reactome pathway
n/an/a 14n/an/an/an/an/an/a
CIBA-GEIGY Corporation
Curated by ChEMBL
Assay Description
Inhibition of NEP 24.11 from rat kidney
J Med Chem 36: 3821-8 (1994)
BindingDB Entry DOI: 10.7270/Q2ZS2X5D