BDBM50042892 CHEMBL3354534
SMILES: CC(C)(C)c1cc(NC(=O)[C@@H]2CCCCN2C2CCOCC2)no1
InChI Key: InChIKey=FXRSRBHQIDUXMJ-AWEZNQCLSA-N
Data: 2 EC50
Activity Spreadsheet -- Enzyme Inhibition Constant Data from BindingDB
Found 2 hits for monomerid = 50042892
Trg + Lig
Ki
nM
ΔG°
kcal/mole
IC50
nM
Kd
nM
EC50/IC50
nM
koff
s-1
kon
M-1s-1
pHTemp
°C
Cannabinoid receptor 2
(Homo sapiens (Human))
BDBM50042892
(CHEMBL3354534)
Show SMILES CC(C)(C)c1cc(NC(=O)[C@@H]2CCCCN2C2CCOCC2)no1 |r|
Show InChI InChI=1S/C18H29N3O3/c1-18(2,3)15-12-16(20-24-15)19-17(22)14-6-4-5-9-21(14)13-7-10-23-11-8-13/h12-14H,4-11H2,1-3H3,(H,19,20,22)/t14-/m0/s1
Reactome pathway
n/an/an/an/a 33n/an/an/an/a
Boehringer Ingelheim Pharmaceuticals
Curated by ChEMBL
Assay Description
Agonist activity at human recombinant CB2 receptor expressing CHO cells assessed as inhibition of forskolin-induced cAMP accumulation incubated for 3...
Bioorg Med Chem Lett 25: 587-92 (2015)
Article DOI: 10.1016/j.bmcl.2014.12.031
BindingDB Entry DOI: 10.7270/Q2QZ2CM5
Cannabinoid receptor 1
(Homo sapiens (Human))
BDBM50042892
(CHEMBL3354534)
Show SMILES CC(C)(C)c1cc(NC(=O)[C@@H]2CCCCN2C2CCOCC2)no1 |r|
Show InChI InChI=1S/C18H29N3O3/c1-18(2,3)15-12-16(20-24-15)19-17(22)14-6-4-5-9-21(14)13-7-10-23-11-8-13/h12-14H,4-11H2,1-3H3,(H,19,20,22)/t14-/m0/s1
NCI pathway
Reactome pathway
n/an/an/an/a>2.00E+4n/an/an/an/a
Boehringer Ingelheim Pharmaceuticals
Curated by ChEMBL
Assay Description
Agonist activity at human recombinant CB1 receptor expressing CHO cells assessed as inhibition of forskolin-induced cAMP accumulation incubated for 3...
Bioorg Med Chem Lett 25: 587-92 (2015)
Article DOI: 10.1016/j.bmcl.2014.12.031
BindingDB Entry DOI: 10.7270/Q2QZ2CM5