BDBM50042897 CHEMBL3354531
SMILES: CC(C)(C)c1cc(NC(=O)[C@@H]2CCCCN2CC2CC2)no1
InChI Key: InChIKey=AJQXBGMQGOBICG-ZDUSSCGKSA-N
Data: 2 EC50
Activity Spreadsheet -- Enzyme Inhibition Constant Data from BindingDB
Found 2 hits for monomerid = 50042897
Trg + Lig
Ki
nM
ΔG°
kcal/mole
IC50
nM
Kd
nM
EC50/IC50
nM
koff
s-1
kon
M-1s-1
pHTemp
°C
Cannabinoid receptor 2
(Homo sapiens (Human))
BDBM50042897
(CHEMBL3354531)
Show SMILES CC(C)(C)c1cc(NC(=O)[C@@H]2CCCCN2CC2CC2)no1 |r|
Show InChI InChI=1S/C17H27N3O2/c1-17(2,3)14-10-15(19-22-14)18-16(21)13-6-4-5-9-20(13)11-12-7-8-12/h10,12-13H,4-9,11H2,1-3H3,(H,18,19,21)/t13-/m0/s1
Reactome pathway
n/an/an/an/a 0.900n/an/an/an/a
Boehringer Ingelheim Pharmaceuticals
Curated by ChEMBL
Assay Description
Agonist activity at human recombinant CB2 receptor expressing CHO cells assessed as inhibition of forskolin-induced cAMP accumulation incubated for 3...
Bioorg Med Chem Lett 25: 587-92 (2015)
Article DOI: 10.1016/j.bmcl.2014.12.031
BindingDB Entry DOI: 10.7270/Q2QZ2CM5
Cannabinoid receptor 1
(Homo sapiens (Human))
BDBM50042897
(CHEMBL3354531)
Show SMILES CC(C)(C)c1cc(NC(=O)[C@@H]2CCCCN2CC2CC2)no1 |r|
Show InChI InChI=1S/C17H27N3O2/c1-17(2,3)14-10-15(19-22-14)18-16(21)13-6-4-5-9-20(13)11-12-7-8-12/h10,12-13H,4-9,11H2,1-3H3,(H,18,19,21)/t13-/m0/s1
NCI pathway
Reactome pathway
n/an/an/an/a 2.94E+3n/an/an/an/a
Boehringer Ingelheim Pharmaceuticals
Curated by ChEMBL
Assay Description
Agonist activity at human recombinant CB1 receptor expressing CHO cells assessed as inhibition of forskolin-induced cAMP accumulation incubated for 3...
Bioorg Med Chem Lett 25: 587-92 (2015)
Article DOI: 10.1016/j.bmcl.2014.12.031
BindingDB Entry DOI: 10.7270/Q2QZ2CM5