BDBM50042906 CHEMBL3354559
SMILES: CC(C)(C)c1csc(NC(=O)[C@@H]2CCCCN2C(=O)N2CCS(=O)(=O)CC2)n1
InChI Key: InChIKey=DYFROXDOAHXCTA-ZDUSSCGKSA-N
Data: 2 EC50
Activity Spreadsheet -- Enzyme Inhibition Constant Data from BindingDB
Found 2 hits for monomerid = 50042906
Trg + Lig
Ki
nM
ΔG°
kcal/mole
IC50
nM
Kd
nM
EC50/IC50
nM
koff
s-1
kon
M-1s-1
pHTemp
°C
Cannabinoid receptor 1
(Homo sapiens (Human))
BDBM50042906
(CHEMBL3354559)
Show SMILES CC(C)(C)c1csc(NC(=O)[C@@H]2CCCCN2C(=O)N2CCS(=O)(=O)CC2)n1 |r|
Show InChI InChI=1S/C18H28N4O4S2/c1-18(2,3)14-12-27-16(19-14)20-15(23)13-6-4-5-7-22(13)17(24)21-8-10-28(25,26)11-9-21/h12-13H,4-11H2,1-3H3,(H,19,20,23)/t13-/m0/s1
NCI pathway
Reactome pathway
n/an/an/an/a>2.00E+4n/an/an/an/a
Boehringer Ingelheim Pharmaceuticals
Curated by ChEMBL
Assay Description
Agonist activity at human recombinant CB1 receptor expressing CHO cells assessed as inhibition of forskolin-induced cAMP accumulation incubated for 3...
Bioorg Med Chem Lett 25: 587-92 (2015)
Article DOI: 10.1016/j.bmcl.2014.12.031
BindingDB Entry DOI: 10.7270/Q2QZ2CM5
Cannabinoid receptor 2
(Homo sapiens (Human))
BDBM50042906
(CHEMBL3354559)
Show SMILES CC(C)(C)c1csc(NC(=O)[C@@H]2CCCCN2C(=O)N2CCS(=O)(=O)CC2)n1 |r|
Show InChI InChI=1S/C18H28N4O4S2/c1-18(2,3)14-12-27-16(19-14)20-15(23)13-6-4-5-7-22(13)17(24)21-8-10-28(25,26)11-9-21/h12-13H,4-11H2,1-3H3,(H,19,20,23)/t13-/m0/s1
Reactome pathway
n/an/an/an/a>1.00E+3n/an/an/an/a
Boehringer Ingelheim Pharmaceuticals
Curated by ChEMBL
Assay Description
Agonist activity at human recombinant CB2 receptor expressing CHO cells assessed as inhibition of forskolin-induced cAMP accumulation incubated for 3...
Bioorg Med Chem Lett 25: 587-92 (2015)
Article DOI: 10.1016/j.bmcl.2014.12.031
BindingDB Entry DOI: 10.7270/Q2QZ2CM5