BDBM50042923 CHEMBL3354566
SMILES: Cn1c2cnc3ccc(cc3c2n(-c2ccc(cc2)C2(CC2)C#N)c1=O)-c1cnc2ccccc2c1
InChI Key: InChIKey=MPZUHFMONDTNMH-UHFFFAOYSA-N
Data: 4 IC50
Activity Spreadsheet -- Enzyme Inhibition Constant Data from BindingDB
Found 4 hits for monomerid = 50042923
Trg + Lig
Ki
nM
ΔG°
kcal/mole
IC50
nM
Kd
nM
EC50/IC50
nM
koff
s-1
kon
M-1s-1
pHTemp
°C
Phosphatidylinositol 4-phosphate 3-kinase C2 domain-containing subunit beta
(Homo sapiens (Human))
BDBM50042923
(CHEMBL3354566)
Show SMILES Cn1c2cnc3ccc(cc3c2n(-c2ccc(cc2)C2(CC2)C#N)c1=O)-c1cnc2ccccc2c1
Show InChI InChI=1S/C30H21N5O/c1-34-27-17-33-26-11-6-19(21-14-20-4-2-3-5-25(20)32-16-21)15-24(26)28(27)35(29(34)36)23-9-7-22(8-10-23)30(18-31)12-13-30/h2-11,14-17H,12-13H2,1H3
NCI pathway
Reactome pathway
n/an/a 44n/an/an/an/an/an/a
Monash University (Parkville Campus)
Curated by ChEMBL
Assay Description
Inhibition of human PI3KC2beta by non-radiometric ADP-Glo assay
ACS Med Chem Lett 6: 3-6 (2015)
Article DOI: 10.1021/ml500354e
BindingDB Entry DOI: 10.7270/Q2M61MWR
Serine/threonine-protein kinase mTOR
(Homo sapiens (Human))
BDBM50042923
(CHEMBL3354566)
Show SMILES Cn1c2cnc3ccc(cc3c2n(-c2ccc(cc2)C2(CC2)C#N)c1=O)-c1cnc2ccccc2c1
Show InChI InChI=1S/C30H21N5O/c1-34-27-17-33-26-11-6-19(21-14-20-4-2-3-5-25(20)32-16-21)15-24(26)28(27)35(29(34)36)23-9-7-22(8-10-23)30(18-31)12-13-30/h2-11,14-17H,12-13H2,1H3
NCI pathway
Reactome pathway
n/an/a 2n/an/an/an/an/an/a
Monash University (Parkville Campus)
Curated by ChEMBL
Assay Description
Inhibition of human mTOR by non-radiometric ADP-Glo assay
ACS Med Chem Lett 6: 3-6 (2015)
Article DOI: 10.1021/ml500354e
BindingDB Entry DOI: 10.7270/Q2M61MWR
Phosphatidylinositol 4,5-bisphosphate 3-kinase catalytic subunit alpha isoform
(Homo sapiens (Human))
BDBM50042923
(CHEMBL3354566)
Show SMILES Cn1c2cnc3ccc(cc3c2n(-c2ccc(cc2)C2(CC2)C#N)c1=O)-c1cnc2ccccc2c1
Show InChI InChI=1S/C30H21N5O/c1-34-27-17-33-26-11-6-19(21-14-20-4-2-3-5-25(20)32-16-21)15-24(26)28(27)35(29(34)36)23-9-7-22(8-10-23)30(18-31)12-13-30/h2-11,14-17H,12-13H2,1H3
NCI pathway
Reactome pathway
n/an/a 7n/an/an/an/an/an/a
Monash University (Parkville Campus)
Curated by ChEMBL
Assay Description
Inhibition of human PI3KCalpha by non-radiometric ADP-Glo assay
ACS Med Chem Lett 6: 3-6 (2015)
Article DOI: 10.1021/ml500354e
BindingDB Entry DOI: 10.7270/Q2M61MWR
Phosphatidylinositol 4-phosphate 3-kinase C2 domain-containing subunit alpha
(Homo sapiens (Human))
BDBM50042923
(CHEMBL3354566)
Show SMILES Cn1c2cnc3ccc(cc3c2n(-c2ccc(cc2)C2(CC2)C#N)c1=O)-c1cnc2ccccc2c1
Show InChI InChI=1S/C30H21N5O/c1-34-27-17-33-26-11-6-19(21-14-20-4-2-3-5-25(20)32-16-21)15-24(26)28(27)35(29(34)36)23-9-7-22(8-10-23)30(18-31)12-13-30/h2-11,14-17H,12-13H2,1H3
n/an/a 34n/an/an/an/an/an/a
Monash University (Parkville Campus)
Curated by ChEMBL
Assay Description
Inhibition of human PI3KC2alpha by non-radiometric ADP-Glo assay
ACS Med Chem Lett 6: 3-6 (2015)
Article DOI: 10.1021/ml500354e
BindingDB Entry DOI: 10.7270/Q2M61MWR