BDBM50043371 1,8-Dihydroxy-10-[2-(4-methoxy-phenyl)-acetyl]-10H-anthracen-9-one::CHEMBL107703
SMILES: COc1ccc(CC(=O)C2c3cccc(O)c3C(=O)c3c(O)cccc23)cc1
InChI Key: InChIKey=KTVVIQKGFNOEAM-UHFFFAOYSA-N
Data: 1 IC50
Activity Spreadsheet -- Enzyme Inhibition Constant Data from BindingDB
Found 1 hit for monomerid = 50043371
Trg + Lig
Ki
nM
ΔG°
kcal/mole
IC50
nM
Kd
nM
EC50/IC50
nM
koff
s-1
kon
M-1s-1
pHTemp
°C
Arachidonate 5-lipoxygenase
(Bos taurus)
BDBM50043371
(1,8-Dihydroxy-10-[2-(4-methoxy-phenyl)-acetyl]-10H...)
Show SMILES COc1ccc(CC(=O)C2c3cccc(O)c3C(=O)c3c(O)cccc23)cc1
Show InChI InChI=1S/C23H18O5/c1-28-14-10-8-13(9-11-14)12-19(26)20-15-4-2-6-17(24)21(15)23(27)22-16(20)5-3-7-18(22)25/h2-11,20,24-25H,12H2,1H3
Reactome pathway
n/an/a 500n/an/an/an/an/an/a
Universität Regensburg
Curated by ChEMBL
Assay Description
Inhibitory activity against 5-lipoxygenase (inhibition of 5-HETE and LTB4 biosynthesis) in bovine polymorphonuclear leukocytes (PMNL).
J Med Chem 36: 4099-107 (1994)
BindingDB Entry DOI: 10.7270/Q2G44PC2