BDBM50043382 CHEMBL3355069
SMILES: CN(C)S(=O)(=O)c1ccc(cc1)-c1cnc2ccc(nn12)-c1ccnc2[nH]ccc12
InChI Key: InChIKey=ZPRINXXEBIDTGA-UHFFFAOYSA-N
Data: 3 IC50
Activity Spreadsheet -- Enzyme Inhibition Constant Data from BindingDB
Found 3 hits for monomerid = 50043382
Trg + Lig
Ki
nM
ΔG°
kcal/mole
IC50
nM
Kd
nM
EC50/IC50
nM
koff
s-1
kon
M-1s-1
pHTemp
°C
Serine/threonine-protein kinase ATR
(Homo sapiens (Human))
BDBM50043382
(CHEMBL3355069)
Show SMILES CN(C)S(=O)(=O)c1ccc(cc1)-c1cnc2ccc(nn12)-c1ccnc2[nH]ccc12
Show InChI InChI=1S/C21H18N6O2S/c1-26(2)30(28,29)15-5-3-14(4-6-15)19-13-24-20-8-7-18(25-27(19)20)16-9-11-22-21-17(16)10-12-23-21/h3-13H,1-2H3,(H,22,23)
Reactome pathway
n/an/a 0.5n/an/an/an/an/an/a
Novartis Institutes for Biomedical Research
Curated by ChEMBL
Assay Description
Inhibition of ATR (unknown origin) using Avi-tagged protein substrate by alphascreen assay
ACS Med Chem Lett 6: 37-41 (2015)
Article DOI: 10.1021/ml500353p
BindingDB Entry DOI: 10.7270/Q228097V
Phosphatidylinositol 4,5-bisphosphate 3-kinase catalytic subunit alpha isoform
(Homo sapiens (Human))
BDBM50043382
(CHEMBL3355069)
Show SMILES CN(C)S(=O)(=O)c1ccc(cc1)-c1cnc2ccc(nn12)-c1ccnc2[nH]ccc12
Show InChI InChI=1S/C21H18N6O2S/c1-26(2)30(28,29)15-5-3-14(4-6-15)19-13-24-20-8-7-18(25-27(19)20)16-9-11-22-21-17(16)10-12-23-21/h3-13H,1-2H3,(H,22,23)
NCI pathway
Reactome pathway
n/an/a 40n/an/an/an/an/an/a
Novartis Institutes for Biomedical Research
Curated by ChEMBL
Assay Description
Inhibition of PI3Kalpha (unknown origin)
ACS Med Chem Lett 6: 37-41 (2015)
Article DOI: 10.1021/ml500353p
BindingDB Entry DOI: 10.7270/Q228097V
Serine/threonine-protein kinase Chk1
(Homo sapiens (Human))
BDBM50043382
(CHEMBL3355069)
Show SMILES CN(C)S(=O)(=O)c1ccc(cc1)-c1cnc2ccc(nn12)-c1ccnc2[nH]ccc12
Show InChI InChI=1S/C21H18N6O2S/c1-26(2)30(28,29)15-5-3-14(4-6-15)19-13-24-20-8-7-18(25-27(19)20)16-9-11-22-21-17(16)10-12-23-21/h3-13H,1-2H3,(H,22,23)
Reactome pathway
n/an/a 44n/an/an/an/an/an/a
Novartis Institutes for Biomedical Research
Curated by ChEMBL
Assay Description
Inhibition of CHK1 in HeLa S3 cells assessed as inhibition of phosphorylation at ser345 by AlphaScreen SureFire CHK1 (p-Ser345) assay
ACS Med Chem Lett 6: 37-41 (2015)
Article DOI: 10.1021/ml500353p
BindingDB Entry DOI: 10.7270/Q228097V