BDBM50043417 CHEMBL3355517
SMILES: O=S(=O)(Nc1ccccc1)c1ccc(cc1)-c1nccnc1Cc1ccccc1
InChI Key: InChIKey=OQHGYDFCYFPABG-UHFFFAOYSA-N
Data: 1 IC50
Activity Spreadsheet -- Enzyme Inhibition Constant Data from BindingDB
Found 1 hit for monomerid = 50043417
Trg + Lig
Ki
nM
ΔG°
kcal/mole
IC50
nM
Kd
nM
EC50/IC50
nM
koff
s-1
kon
M-1s-1
pHTemp
°C
LIM domain kinase 2
(Homo sapiens (Human))
BDBM50043417
(CHEMBL3355517)
Show SMILES O=S(=O)(Nc1ccccc1)c1ccc(cc1)-c1nccnc1Cc1ccccc1
Show InChI InChI=1S/C23H19N3O2S/c27-29(28,26-20-9-5-2-6-10-20)21-13-11-19(12-14-21)23-22(24-15-16-25-23)17-18-7-3-1-4-8-18/h1-16,26H,17H2
NCI pathway
Reactome pathway
n/an/a 90n/an/an/an/an/an/a
Lexicon Pharmaceuticals
Curated by ChEMBL
Assay Description
Inhibition of human full-length LIMK2 expressed in Sf9 cells assessed as incorporation of [33P] from ATP into biotinylated-cofilin substrate in prese...
ACS Med Chem Lett 6: 53-7 (2015)
Article DOI: 10.1021/ml500242y
BindingDB Entry DOI: 10.7270/Q2SQ9207