BDBM50043423 CHEMBL3355511
SMILES: NCCN(Cc1ccccc1)C(=O)c1ccc(cc1)S(=O)(=O)Nc1ccccc1
InChI Key: InChIKey=GBLCVNINRYFFJV-UHFFFAOYSA-N
Data: 1 IC50
Activity Spreadsheet -- Enzyme Inhibition Constant Data from BindingDB
Found 1 hit for monomerid = 50043423
Trg + Lig
Ki
nM
ΔG°
kcal/mole
IC50
nM
Kd
nM
EC50/IC50
nM
koff
s-1
kon
M-1s-1
pHTemp
°C
LIM domain kinase 2
(Homo sapiens (Human))
BDBM50043423
(CHEMBL3355511)
Show SMILES NCCN(Cc1ccccc1)C(=O)c1ccc(cc1)S(=O)(=O)Nc1ccccc1
Show InChI InChI=1S/C22H23N3O3S/c23-15-16-25(17-18-7-3-1-4-8-18)22(26)19-11-13-21(14-12-19)29(27,28)24-20-9-5-2-6-10-20/h1-14,24H,15-17,23H2
NCI pathway
Reactome pathway
n/an/a 1.20E+3n/an/an/an/an/an/a
Lexicon Pharmaceuticals
Curated by ChEMBL
Assay Description
Inhibition of human full-length LIMK2 expressed in Sf9 cells assessed as incorporation of [33P] from ATP into biotinylated-cofilin substrate in prese...
ACS Med Chem Lett 6: 53-7 (2015)
Article DOI: 10.1021/ml500242y
BindingDB Entry DOI: 10.7270/Q2SQ9207