BDBM50043615 CHEMBL3355498
SMILES: CN(Cc1ccc(cc1)C(O)CO)C(=O)c1ccc(cc1)S(=O)(=O)Nc1ccccc1
InChI Key: InChIKey=LJBXWGVECYNLLM-UHFFFAOYSA-N
Data: 1 IC50
PDB links: 1 PDB ID matches this monomer.
Activity Spreadsheet -- Enzyme Inhibition Constant Data from BindingDB
Found 1 hit for monomerid = 50043615
Trg + Lig
Ki
nM
ΔG°
kcal/mole
IC50
nM
Kd
nM
EC50/IC50
nM
koff
s-1
kon
M-1s-1
pHTemp
°C
LIM domain kinase 2
(Homo sapiens (Human))
BDBM50043615
(CHEMBL3355498)
Show SMILES CN(Cc1ccc(cc1)C(O)CO)C(=O)c1ccc(cc1)S(=O)(=O)Nc1ccccc1
Show InChI InChI=1S/C23H24N2O5S/c1-25(15-17-7-9-18(10-8-17)22(27)16-26)23(28)19-11-13-21(14-12-19)31(29,30)24-20-5-3-2-4-6-20/h2-14,22,24,26-27H,15-16H2,1H3
NCI pathway
Reactome pathway
n/an/a 92n/an/an/an/an/an/a
Lexicon Pharmaceuticals
Curated by ChEMBL
Assay Description
Inhibition of human full-length LIMK2 expressed in Sf9 cells assessed as incorporation of [33P] from ATP into biotinylated-cofilin substrate in prese...
ACS Med Chem Lett 6: 53-7 (2015)
Article DOI: 10.1021/ml500242y
BindingDB Entry DOI: 10.7270/Q2SQ9207
3D
3D Structure (crystal)