BDBM50043617 CHEMBL3355496
SMILES: COCCOc1ccc(CN(C)C(=O)c2ccc(cc2)S(=O)(=O)Nc2ccccc2)cc1
InChI Key: InChIKey=KDSVANHTYAGFHO-UHFFFAOYSA-N
Data: 1 IC50
Activity Spreadsheet -- Enzyme Inhibition Constant Data from BindingDB
Found 1 hit for monomerid = 50043617
Trg + Lig
Ki
nM
ΔG°
kcal/mole
IC50
nM
Kd
nM
EC50/IC50
nM
koff
s-1
kon
M-1s-1
pHTemp
°C
LIM domain kinase 2
(Homo sapiens (Human))
BDBM50043617
(CHEMBL3355496)
Show SMILES COCCOc1ccc(CN(C)C(=O)c2ccc(cc2)S(=O)(=O)Nc2ccccc2)cc1
Show InChI InChI=1S/C24H26N2O5S/c1-26(18-19-8-12-22(13-9-19)31-17-16-30-2)24(27)20-10-14-23(15-11-20)32(28,29)25-21-6-4-3-5-7-21/h3-15,25H,16-18H2,1-2H3
NCI pathway
Reactome pathway
n/an/a 34n/an/an/an/an/an/a
Lexicon Pharmaceuticals
Curated by ChEMBL
Assay Description
Inhibition of human full-length LIMK2 expressed in Sf9 cells assessed as incorporation of [33P] from ATP into biotinylated-cofilin substrate in prese...
ACS Med Chem Lett 6: 53-7 (2015)
Article DOI: 10.1021/ml500242y
BindingDB Entry DOI: 10.7270/Q2SQ9207