BDBM50043620 CHEMBL3355494
SMILES: CN(C)c1cccc(NS(=O)(=O)c2ccc(cc2)C(=O)N(C)Cc2ccccc2)c1
InChI Key: InChIKey=NWNKAJGVSLONKZ-UHFFFAOYSA-N
Data: 1 IC50
Activity Spreadsheet -- Enzyme Inhibition Constant Data from BindingDB
Found 1 hit for monomerid = 50043620
Trg + Lig
Ki
nM
ΔG°
kcal/mole
IC50
nM
Kd
nM
EC50/IC50
nM
koff
s-1
kon
M-1s-1
pHTemp
°C
LIM domain kinase 2
(Homo sapiens (Human))
BDBM50043620
(CHEMBL3355494)
Show SMILES CN(C)c1cccc(NS(=O)(=O)c2ccc(cc2)C(=O)N(C)Cc2ccccc2)c1
Show InChI InChI=1S/C23H25N3O3S/c1-25(2)21-11-7-10-20(16-21)24-30(28,29)22-14-12-19(13-15-22)23(27)26(3)17-18-8-5-4-6-9-18/h4-16,24H,17H2,1-3H3
NCI pathway
Reactome pathway
n/an/a>2.70E+4n/an/an/an/an/an/a
Lexicon Pharmaceuticals
Curated by ChEMBL
Assay Description
Inhibition of human full-length LIMK2 expressed in Sf9 cells assessed as incorporation of [33P] from ATP into biotinylated-cofilin substrate in prese...
ACS Med Chem Lett 6: 53-7 (2015)
Article DOI: 10.1021/ml500242y
BindingDB Entry DOI: 10.7270/Q2SQ9207