BDBM50043723 (S)-2-{[(4R,7S)-13-[(S)-2-Amino-3-(4-hydroxy-phenyl)-propionylamino]-7-(4-iodo-benzyl)-14,14-dimethyl-6,9,12-trioxo-1,2-dithia-5,8,11-triaza-cyclotetradecane-4-carbonyl]-amino}-3-phenyl-propionic acid::CHEMBL2372310
SMILES: CC1(C)SSC[C@H](NC(=O)[C@H](Cc2ccc(I)cc2)NC(=O)CNC(=O)[C@@H]1NC(=O)[C@@H](N)Cc1ccc(O)cc1)C(=O)N[C@@H](Cc1ccccc1)C(O)=O
InChI Key: InChIKey=SLRIOOLBTDCCPO-OLAIZJASSA-N
Data: 4 IC50
Activity Spreadsheet -- Enzyme Inhibition Constant Data from BindingDB
Found 4 hits for monomerid = 50043723
Trg + Lig
Ki
nM
ΔG°
kcal/mole
IC50
nM
Kd
nM
EC50/IC50
nM
koff
s-1
kon
M-1s-1
pHTemp
°C
Mu-type opioid receptor
(Rattus norvegicus (rat))
BDBM50043723
((S)-2-{[(4R,7S)-13-[(S)-2-Amino-3-(4-hydroxy-pheny...)
Show SMILES CC1(C)SSC[C@H](NC(=O)[C@H](Cc2ccc(I)cc2)NC(=O)CNC(=O)[C@@H]1NC(=O)[C@@H](N)Cc1ccc(O)cc1)C(=O)N[C@@H](Cc1ccccc1)C(O)=O
Show InChI InChI=1S/C37H43IN6O8S2/c1-37(2)31(44-32(47)26(39)16-22-10-14-25(45)15-11-22)35(50)40-19-30(46)41-27(17-23-8-12-24(38)13-9-23)33(48)43-29(20-53-54-37)34(49)42-28(36(51)52)18-21-6-4-3-5-7-21/h3-15,26-29,31,45H,16-20,39H2,1-2H3,(H,40,50)(H,41,46)(H,42,49)(H,43,48)(H,44,47)(H,51,52)/t26-,27-,28-,29-,31-/m0/s1
Reactome pathway
n/an/a 1.60E+3n/an/an/an/an/an/a
University of Arizona
Curated by ChEMBL
Assay Description
Binding affinity towards mu opioid receptor was determined in rat brain using [3H]CTOP as radioligand
J Med Chem 37: 146-50 (1994)
BindingDB Entry DOI: 10.7270/Q2TX3G09
Delta-type opioid receptor
(MOUSE)
BDBM50043723
((S)-2-{[(4R,7S)-13-[(S)-2-Amino-3-(4-hydroxy-pheny...)
Show SMILES CC1(C)SSC[C@H](NC(=O)[C@H](Cc2ccc(I)cc2)NC(=O)CNC(=O)[C@@H]1NC(=O)[C@@H](N)Cc1ccc(O)cc1)C(=O)N[C@@H](Cc1ccccc1)C(O)=O
Show InChI InChI=1S/C37H43IN6O8S2/c1-37(2)31(44-32(47)26(39)16-22-10-14-25(45)15-11-22)35(50)40-19-30(46)41-27(17-23-8-12-24(38)13-9-23)33(48)43-29(20-53-54-37)34(49)42-28(36(51)52)18-21-6-4-3-5-7-21/h3-15,26-29,31,45H,16-20,39H2,1-2H3,(H,40,50)(H,41,46)(H,42,49)(H,43,48)(H,44,47)(H,51,52)/t26-,27-,28-,29-,31-/m0/s1
Reactome pathway
n/an/a 0.300n/an/an/an/an/an/a
University of Arizona
Curated by ChEMBL
Assay Description
Inhibitory concentration against delta opioid receptor of electrically induced smooth muscle contraction of mouse vas deferens
J Med Chem 37: 146-50 (1994)
BindingDB Entry DOI: 10.7270/Q2TX3G09
Mu-type opioid receptor
(GUINEA PIG)
BDBM50043723
((S)-2-{[(4R,7S)-13-[(S)-2-Amino-3-(4-hydroxy-pheny...)
Show SMILES CC1(C)SSC[C@H](NC(=O)[C@H](Cc2ccc(I)cc2)NC(=O)CNC(=O)[C@@H]1NC(=O)[C@@H](N)Cc1ccc(O)cc1)C(=O)N[C@@H](Cc1ccccc1)C(O)=O
Show InChI InChI=1S/C37H43IN6O8S2/c1-37(2)31(44-32(47)26(39)16-22-10-14-25(45)15-11-22)35(50)40-19-30(46)41-27(17-23-8-12-24(38)13-9-23)33(48)43-29(20-53-54-37)34(49)42-28(36(51)52)18-21-6-4-3-5-7-21/h3-15,26-29,31,45H,16-20,39H2,1-2H3,(H,40,50)(H,41,46)(H,42,49)(H,43,48)(H,44,47)(H,51,52)/t26-,27-,28-,29-,31-/m0/s1
n/an/a 640n/an/an/an/an/an/a
University of Arizona
Curated by ChEMBL
Assay Description
Inhibitory concentration against electrically evoked contractions of guinea pig ileum longitudinal muscle-myenteric plexus
J Med Chem 37: 146-50 (1994)
BindingDB Entry DOI: 10.7270/Q2TX3G09
Opioid receptors; mu & delta
(Rattus norvegicus (rat))
BDBM50043723
((S)-2-{[(4R,7S)-13-[(S)-2-Amino-3-(4-hydroxy-pheny...)
Show SMILES CC1(C)SSC[C@H](NC(=O)[C@H](Cc2ccc(I)cc2)NC(=O)CNC(=O)[C@@H]1NC(=O)[C@@H](N)Cc1ccc(O)cc1)C(=O)N[C@@H](Cc1ccccc1)C(O)=O
Show InChI InChI=1S/C37H43IN6O8S2/c1-37(2)31(44-32(47)26(39)16-22-10-14-25(45)15-11-22)35(50)40-19-30(46)41-27(17-23-8-12-24(38)13-9-23)33(48)43-29(20-53-54-37)34(49)42-28(36(51)52)18-21-6-4-3-5-7-21/h3-15,26-29,31,45H,16-20,39H2,1-2H3,(H,40,50)(H,41,46)(H,42,49)(H,43,48)(H,44,47)(H,51,52)/t26-,27-,28-,29-,31-/m0/s1
Reactome pathway
n/an/a 1.20n/an/an/an/an/an/a
University of Arizona
Curated by ChEMBL
Assay Description
Binding affinity towards delta opioid receptor was determined in rat brain using [H]-[p-Cl-Phe4]-DPDPE as radioligand
J Med Chem 37: 146-50 (1994)
BindingDB Entry DOI: 10.7270/Q2TX3G09