BDBM50043872 CHEMBL3356058::US9174993, 10::US9221828, 10
SMILES: Cc1n[nH]c2nc(cnc12)-c1ccc(NS(=O)(=O)c2cccc(Cl)c2Cl)cc1
InChI Key: InChIKey=QUBOLPJSCCUVLM-UHFFFAOYSA-N
Data: 4 IC50
Activity Spreadsheet -- Enzyme Inhibition Constant Data from BindingDB
Found 4 hits for monomerid = 50043872
Trg + Lig
Ki
nM
ΔG°
kcal/mole
IC50
nM
Kd
nM
EC50/IC50
nM
koff
s-1
kon
M-1s-1
pHTemp
°C
Serine/threonine-protein kinase Sgk1
(Homo sapiens (Human))
BDBM50043872
(CHEMBL3356058 | US9174993, 10 | US9221828, 10)
Show SMILES Cc1n[nH]c2nc(cnc12)-c1ccc(NS(=O)(=O)c2cccc(Cl)c2Cl)cc1
Show InChI InChI=1S/C18H13Cl2N5O2S/c1-10-17-18(24-23-10)22-14(9-21-17)11-5-7-12(8-6-11)25-28(26,27)15-4-2-3-13(19)16(15)20/h2-9,25H,1H3,(H,22,23,24)
Reactome pathway
US Patent
n/an/a 13n/an/an/an/an/an/a
SANOFI
US Patent
Assay Description
The compounds were tested for serum and glucocorticoid-regulated kinase 1 (SGK-1) inhibitory activity in a substrate phosphorylation assay designed t...
US Patent US9174993 (2015)
BindingDB Entry DOI: 10.7270/Q2MK6BPF
Serine/threonine-protein kinase Sgk1
(Homo sapiens (Human))
BDBM50043872
(CHEMBL3356058 | US9174993, 10 | US9221828, 10)
Show SMILES Cc1n[nH]c2nc(cnc12)-c1ccc(NS(=O)(=O)c2cccc(Cl)c2Cl)cc1
Show InChI InChI=1S/C18H13Cl2N5O2S/c1-10-17-18(24-23-10)22-14(9-21-17)11-5-7-12(8-6-11)25-28(26,27)15-4-2-3-13(19)16(15)20/h2-9,25H,1H3,(H,22,23,24)
Reactome pathway
n/an/a 13n/an/an/an/an/an/a
Sanofi R&D
Curated by ChEMBL
Assay Description
Inhibition of human SGK1 using fluo-5(6)-carboxyfluorescein)-RPRAATF-NH2 fluorescently labeled peptide by substrate phosphorylation assay in presence...
ACS Med Chem Lett 6: 73-8 (2015)
Article DOI: 10.1021/ml5003376
BindingDB Entry DOI: 10.7270/Q28S4RJT
Serine/threonine-protein kinase Sgk1
(Homo sapiens (Human))
BDBM50043872
(CHEMBL3356058 | US9174993, 10 | US9221828, 10)
Show SMILES Cc1n[nH]c2nc(cnc12)-c1ccc(NS(=O)(=O)c2cccc(Cl)c2Cl)cc1
Show InChI InChI=1S/C18H13Cl2N5O2S/c1-10-17-18(24-23-10)22-14(9-21-17)11-5-7-12(8-6-11)25-28(26,27)15-4-2-3-13(19)16(15)20/h2-9,25H,1H3,(H,22,23,24)
Reactome pathway
n/an/a 605n/an/an/an/an/an/a
Sanofi R&D
Curated by ChEMBL
Assay Description
Inhibition of human SGK1 using fluo-5(6)-carboxyfluorescein)-RPRAATF-NH2 fluorescently labeled peptide by substrate phosphorylation assay in presence...
ACS Med Chem Lett 6: 73-8 (2015)
Article DOI: 10.1021/ml5003376
BindingDB Entry DOI: 10.7270/Q28S4RJT
Serine/threonine-protein kinase Sgk1
(Homo sapiens (Human))
BDBM50043872
(CHEMBL3356058 | US9174993, 10 | US9221828, 10)
Show SMILES Cc1n[nH]c2nc(cnc12)-c1ccc(NS(=O)(=O)c2cccc(Cl)c2Cl)cc1
Show InChI InChI=1S/C18H13Cl2N5O2S/c1-10-17-18(24-23-10)22-14(9-21-17)11-5-7-12(8-6-11)25-28(26,27)15-4-2-3-13(19)16(15)20/h2-9,25H,1H3,(H,22,23,24)
Reactome pathway
US Patent
n/an/a 13n/an/an/an/a7.424
SANOFI
US Patent
Assay Description
The enzyme reaction was carried out in a buffer containing 25 mM Tris-HCl (pH 7.4), 5 mM MgCl2, 2 mM MnCl2, 2 mM DTT, and 0.03% bovine serum albumi...
US Patent US9221828 (2015)
BindingDB Entry DOI: 10.7270/Q2GX49DW