BDBM50043913 3-(2-Hydroxy-ethyl)-4,4-dioxo-1,2,3,4-tetrahydro-4lambda*6*-thieno[2,3-b][1,4]thiazine-6-sulfonic acid amide::CHEMBL310280
SMILES: NS(=O)(=O)c1cc2NCC(CCO)S(=O)(=O)c2s1
InChI Key: InChIKey=SWJFJILZVWPRQR-UHFFFAOYSA-N
Data: 1 KI  1 IC50
Activity Spreadsheet -- Enzyme Inhibition Constant Data from BindingDB
Found 2 hits for monomerid = 50043913
Trg + Lig
Ki
nM
ΔG°
kcal/mole
IC50
nM
Kd
nM
EC50/IC50
nM
koff
s-1
kon
M-1s-1
pHTemp
°C
Carbonic anhydrase 2
(Homo sapiens (Human))
BDBM50043913
(3-(2-Hydroxy-ethyl)-4,4-dioxo-1,2,3,4-tetrahydro-4...)
Show SMILES NS(=O)(=O)c1cc2NCC(CCO)S(=O)(=O)c2s1
Show InChI InChI=1S/C8H12N2O5S3/c9-18(14,15)7-3-6-8(16-7)17(12,13)5(1-2-11)4-10-6/h3,5,10-11H,1-2,4H2,(H2,9,14,15)
Reactome pathway
1.20n/an/an/an/an/an/an/an/a
Merck Research Laboratories
Curated by ChEMBL
Assay Description
Tested for ability to compete with dansylamide for binding to human erythrocyte carbonic-anhydrase-II (HCA-II)
J Med Chem 37: 240-7 (1994)
BindingDB Entry DOI: 10.7270/Q2N29XKD
Carbonic anhydrase 2
(Homo sapiens (Human))
BDBM50043913
(3-(2-Hydroxy-ethyl)-4,4-dioxo-1,2,3,4-tetrahydro-4...)
Show SMILES NS(=O)(=O)c1cc2NCC(CCO)S(=O)(=O)c2s1
Show InChI InChI=1S/C8H12N2O5S3/c9-18(14,15)7-3-6-8(16-7)17(12,13)5(1-2-11)4-10-6/h3,5,10-11H,1-2,4H2,(H2,9,14,15)
Reactome pathway
n/an/a 1.90n/an/an/an/an/an/a
Merck Research Laboratories
Curated by ChEMBL
Assay Description
Tested for ability to inhibit human erythrocyte carbonic-anhydrase-II- (HCA II) catalyzed carbon dioxide hydration
J Med Chem 37: 240-7 (1994)
BindingDB Entry DOI: 10.7270/Q2N29XKD