BDBM50044043 (S)-N-((S)-1-Carbamoyl-2-phenyl-ethyl)-3-[(S)-2-((S)-3-1H-indol-3-yl-2-phenoxycarbonylamino-propionylamino)-6-(3-o-tolyl-ureido)-hexanoylamino]-N-methyl-succinamic acid::CHEMBL322635
SMILES: CN([C@@H](Cc1ccccc1)C(N)=O)C(=O)[C@H](CC(O)=O)NC(=O)[C@H](CCCCNC(=O)Nc1ccccc1C)NC(=O)[C@H](Cc1c[nH]c2ccccc12)NC(=O)Oc1ccccc1
InChI Key: InChIKey=WDIILVQZSNWWBM-GTKRZRNESA-N
Data: 2 IC50
Activity Spreadsheet -- Enzyme Inhibition Constant Data from BindingDB
Found 2 hits for monomerid = 50044043
Trg + Lig
Ki
nM
ΔG°
kcal/mole
IC50
nM
Kd
nM
EC50/IC50
nM
koff
s-1
kon
M-1s-1
pHTemp
°C
Cholecystokinin receptor
(Homo sapiens (Human))
BDBM50044043
((S)-N-((S)-1-Carbamoyl-2-phenyl-ethyl)-3-[(S)-2-((...)
Show SMILES CN([C@@H](Cc1ccccc1)C(N)=O)C(=O)[C@H](CC(O)=O)NC(=O)[C@H](CCCCNC(=O)Nc1ccccc1C)NC(=O)[C@H](Cc1c[nH]c2ccccc12)NC(=O)Oc1ccccc1
Show InChI InChI=1S/C46H52N8O9/c1-29-15-9-11-21-34(29)52-45(61)48-24-14-13-23-36(42(58)51-38(27-40(55)56)44(60)54(2)39(41(47)57)25-30-16-5-3-6-17-30)50-43(59)37(53-46(62)63-32-18-7-4-8-19-32)26-31-28-49-35-22-12-10-20-33(31)35/h3-12,15-22,28,36-39,49H,13-14,23-27H2,1-2H3,(H2,47,57)(H,50,59)(H,51,58)(H,53,62)(H,55,56)(H2,48,52,61)/t36-,37-,38-,39-/m0/s1
Reactome pathway
n/an/a 6.50E+3n/an/an/an/an/an/a
Abbott Laboratories
Curated by ChEMBL
Assay Description
Concentration required to inhibit 50% of specific binding to Cholecystokinin type B receptor in guinea pig cortex using [125I]Bolton-Hunter CCK-8
J Med Chem 37: 309-13 (1994)
BindingDB Entry DOI: 10.7270/Q2445N4S
Cholecystokinin A receptor
(Cavia porcellus)
BDBM50044043
((S)-N-((S)-1-Carbamoyl-2-phenyl-ethyl)-3-[(S)-2-((...)
Show SMILES CN([C@@H](Cc1ccccc1)C(N)=O)C(=O)[C@H](CC(O)=O)NC(=O)[C@H](CCCCNC(=O)Nc1ccccc1C)NC(=O)[C@H](Cc1c[nH]c2ccccc12)NC(=O)Oc1ccccc1
Show InChI InChI=1S/C46H52N8O9/c1-29-15-9-11-21-34(29)52-45(61)48-24-14-13-23-36(42(58)51-38(27-40(55)56)44(60)54(2)39(41(47)57)25-30-16-5-3-6-17-30)50-43(59)37(53-46(62)63-32-18-7-4-8-19-32)26-31-28-49-35-22-12-10-20-33(31)35/h3-12,15-22,28,36-39,49H,13-14,23-27H2,1-2H3,(H2,47,57)(H,50,59)(H,51,58)(H,53,62)(H,55,56)(H2,48,52,61)/t36-,37-,38-,39-/m0/s1
Reactome pathway
n/an/a 4.10n/an/an/an/an/an/a
Abbott Laboratories
Curated by ChEMBL
Assay Description
Inhibition of [125I]Bolton-Hunter CCK-8 binding to cholecystokinin type A receptor in guinea pig pancreas
J Med Chem 37: 309-13 (1994)
BindingDB Entry DOI: 10.7270/Q2445N4S