BDBM50044136 CHEMBL3313977
SMILES: Cn1c(nc2ccc(F)c(F)c12)-c1cncc2ccccc12
InChI Key: InChIKey=INCMATLUFSMWKH-UHFFFAOYSA-N
Data: 1 IC50
Activity Spreadsheet -- Enzyme Inhibition Constant Data from BindingDB
Found 1 hit for monomerid = 50044136
Trg + Lig
Ki
nM
ΔG°
kcal/mole
IC50
nM
Kd
nM
EC50/IC50
nM
koff
s-1
kon
M-1s-1
pHTemp
°C
Cytochrome P450 11B2 (CYP11B2)
(Homo sapiens (Human))
BDBM50044136
(CHEMBL3313977)
Show SMILES Cn1c(nc2ccc(F)c(F)c12)-c1cncc2ccccc12
Show InChI InChI=1S/C17H11F2N3/c1-22-16-14(7-6-13(18)15(16)19)21-17(22)12-9-20-8-10-4-2-3-5-11(10)12/h2-9H,1H3
n/an/a 0.150n/an/an/an/an/an/a
Saarland University and Helmholtz Institute for Pharmaceutical Research Saarland (HIPS)
Curated by ChEMBL
Assay Description
Inhibition of human aldosterone synthase expressed in V79 MZ cells
J Med Chem 57: 5011-22 (2014)
Article DOI: 10.1021/jm401430e
BindingDB Entry DOI: 10.7270/Q2QR4ZRP