BDBM50044334 5-{3-Butyl-5-oxo-4-[2'-(1H-tetrazol-5-yl)-biphenyl-4-ylmethyl]-4,5-dihydro-[1,2,4]triazol-1-yl}-pentanoic acid methyl ester::CHEMBL66173
SMILES: CCCCc1nn(CCCCC(=O)OC)c(=O)n1Cc1ccc(cc1)-c1ccccc1-c1nnn[nH]1
InChI Key: InChIKey=BQUFIDVGYDHRKS-UHFFFAOYSA-N
Data: 3 IC50
Activity Spreadsheet -- Enzyme Inhibition Constant Data from BindingDB
Found 3 hits for monomerid = 50044334
Trg + Lig
Ki
nM
ΔG°
kcal/mole
IC50
nM
Kd
nM
EC50/IC50
nM
koff
s-1
kon
M-1s-1
pHTemp
°C
Angiotensin II AT1B
(RAT)
BDBM50044334
(5-{3-Butyl-5-oxo-4-[2'-(1H-tetrazol-5-yl)-biphenyl...)
Show SMILES CCCCc1nn(CCCCC(=O)OC)c(=O)n1Cc1ccc(cc1)-c1ccccc1-c1nnn[nH]1
Show InChI InChI=1S/C26H31N7O3/c1-3-4-11-23-29-33(17-8-7-12-24(34)36-2)26(35)32(23)18-19-13-15-20(16-14-19)21-9-5-6-10-22(21)25-27-30-31-28-25/h5-6,9-10,13-16H,3-4,7-8,11-12,17-18H2,1-2H3,(H,27,28,30,31)
Reactome pathway
n/an/a 4.40n/an/an/an/an/an/a
Searle R&D
Curated by ChEMBL
Assay Description
Inhibition of [125I]-angiotensin-II binding to the angiotensin II receptor type 1 in rat uterine membranes
J Med Chem 36: 2172-81 (1993)
BindingDB Entry DOI: 10.7270/Q2C53JXM
Angiotensin II receptor (AT-1) type-1
(RAT)
BDBM50044334
(5-{3-Butyl-5-oxo-4-[2'-(1H-tetrazol-5-yl)-biphenyl...)
Show SMILES CCCCc1nn(CCCCC(=O)OC)c(=O)n1Cc1ccc(cc1)-c1ccccc1-c1nnn[nH]1
Show InChI InChI=1S/C26H31N7O3/c1-3-4-11-23-29-33(17-8-7-12-24(34)36-2)26(35)32(23)18-19-13-15-20(16-14-19)21-9-5-6-10-22(21)25-27-30-31-28-25/h5-6,9-10,13-16H,3-4,7-8,11-12,17-18H2,1-2H3,(H,27,28,30,31)
n/an/a 4.40n/an/an/an/an/an/a
TBA
Assay Description
Displacement of [125I]-angiotensin 2 from angiotensin AT1 receptor in Rattus norvegicus (rat) uterine membranes
Citation and Details
Article DOI: 10.1007/s00044-011-9622-4
BindingDB Entry DOI: 10.7270/Q2T156HH
Angiotensin II receptor (AT-1) type-1
(RAT)
BDBM50044334
(5-{3-Butyl-5-oxo-4-[2'-(1H-tetrazol-5-yl)-biphenyl...)
Show SMILES CCCCc1nn(CCCCC(=O)OC)c(=O)n1Cc1ccc(cc1)-c1ccccc1-c1nnn[nH]1
Show InChI InChI=1S/C26H31N7O3/c1-3-4-11-23-29-33(17-8-7-12-24(34)36-2)26(35)32(23)18-19-13-15-20(16-14-19)21-9-5-6-10-22(21)25-27-30-31-28-25/h5-6,9-10,13-16H,3-4,7-8,11-12,17-18H2,1-2H3,(H,27,28,30,31)
n/an/a 4.40n/an/an/an/an/an/a
TBA
Assay Description
Displacement of [125I]-angiotensin 2 from angiotensin AT1 receptor in Rattus norvegicus (rat) uterine membranes
Citation and Details
Article DOI: 10.1007/s00044-011-9622-4
BindingDB Entry DOI: 10.7270/Q2T156HH