BDBM50044345 5-Butyl-2-(2-hydroxy-2-phenyl-ethyl)-4-[2'-(1H-tetrazol-5-yl)-biphenyl-4-ylmethyl]-2,4-dihydro-[1,2,4]triazol-3-one::CHEMBL304329
SMILES: CCCCc1nn(CC(O)c2ccccc2)c(=O)n1Cc1ccc(cc1)-c1ccccc1-c1nnn[nH]1
InChI Key: InChIKey=ALBYDBQPQVBCCO-UHFFFAOYSA-N
Data: 3 IC50
Activity Spreadsheet -- Enzyme Inhibition Constant Data from BindingDB
Found 3 hits for monomerid = 50044345
Trg + Lig
Ki
nM
ΔG°
kcal/mole
IC50
nM
Kd
nM
EC50/IC50
nM
koff
s-1
kon
M-1s-1
pHTemp
°C
Angiotensin II AT1B
(RAT)
BDBM50044345
(5-Butyl-2-(2-hydroxy-2-phenyl-ethyl)-4-[2'-(1H-tet...)
Show SMILES CCCCc1nn(CC(O)c2ccccc2)c(=O)n1Cc1ccc(cc1)-c1ccccc1-c1nnn[nH]1
Show InChI InChI=1S/C28H29N7O2/c1-2-3-13-26-31-35(19-25(36)22-9-5-4-6-10-22)28(37)34(26)18-20-14-16-21(17-15-20)23-11-7-8-12-24(23)27-29-32-33-30-27/h4-12,14-17,25,36H,2-3,13,18-19H2,1H3,(H,29,30,32,33)
Reactome pathway
n/an/a 3.60n/an/an/an/an/an/a
Searle R&D
Curated by ChEMBL
Assay Description
Inhibition of [125I]-angiotensin-II binding to the angiotensin II receptor type 1 in rat uterine membranes
J Med Chem 36: 2172-81 (1993)
BindingDB Entry DOI: 10.7270/Q2C53JXM
Angiotensin II receptor (AT-1) type-1
(RAT)
BDBM50044345
(5-Butyl-2-(2-hydroxy-2-phenyl-ethyl)-4-[2'-(1H-tet...)
Show SMILES CCCCc1nn(CC(O)c2ccccc2)c(=O)n1Cc1ccc(cc1)-c1ccccc1-c1nnn[nH]1
Show InChI InChI=1S/C28H29N7O2/c1-2-3-13-26-31-35(19-25(36)22-9-5-4-6-10-22)28(37)34(26)18-20-14-16-21(17-15-20)23-11-7-8-12-24(23)27-29-32-33-30-27/h4-12,14-17,25,36H,2-3,13,18-19H2,1H3,(H,29,30,32,33)
n/an/a 3.60n/an/an/an/an/an/a
TBA
Assay Description
Displacement of [125I]-angiotensin 2 from angiotensin AT1 receptor in Rattus norvegicus (rat) uterine membranes
Citation and Details
Article DOI: 10.1007/s00044-011-9622-4
BindingDB Entry DOI: 10.7270/Q2T156HH
Angiotensin II receptor (AT-1) type-1
(RAT)
BDBM50044345
(5-Butyl-2-(2-hydroxy-2-phenyl-ethyl)-4-[2'-(1H-tet...)
Show SMILES CCCCc1nn(CC(O)c2ccccc2)c(=O)n1Cc1ccc(cc1)-c1ccccc1-c1nnn[nH]1
Show InChI InChI=1S/C28H29N7O2/c1-2-3-13-26-31-35(19-25(36)22-9-5-4-6-10-22)28(37)34(26)18-20-14-16-21(17-15-20)23-11-7-8-12-24(23)27-29-32-33-30-27/h4-12,14-17,25,36H,2-3,13,18-19H2,1H3,(H,29,30,32,33)
n/an/a 3.60n/an/an/an/an/an/a
TBA
Assay Description
Displacement of [125I]-angiotensin 2 from angiotensin AT1 receptor in Rattus norvegicus (rat) uterine membranes
Citation and Details
Article DOI: 10.1007/s00044-011-9622-4
BindingDB Entry DOI: 10.7270/Q2T156HH