BDBM50044369 5-{3-Butyl-5-oxo-4-[2'-(1H-tetrazol-5-yl)-biphenyl-4-ylmethyl]-4,5-dihydro-[1,2,4]triazol-1-yl}-pentanoic acid::CHEMBL302261
SMILES: CCCCc1nn(CCCCC(O)=O)c(=O)n1Cc1ccc(cc1)-c1ccccc1-c1nnn[nH]1
InChI Key: InChIKey=LJMUWWAXOBQDQV-UHFFFAOYSA-N
Data: 3 IC50
Activity Spreadsheet -- Enzyme Inhibition Constant Data from BindingDB
Found 3 hits for monomerid = 50044369
Trg + Lig
Ki
nM
ΔG°
kcal/mole
IC50
nM
Kd
nM
EC50/IC50
nM
koff
s-1
kon
M-1s-1
pHTemp
°C
Angiotensin II AT1B
(RAT)
BDBM50044369
(5-{3-Butyl-5-oxo-4-[2'-(1H-tetrazol-5-yl)-biphenyl...)
Show SMILES CCCCc1nn(CCCCC(O)=O)c(=O)n1Cc1ccc(cc1)-c1ccccc1-c1nnn[nH]1
Show InChI InChI=1S/C25H29N7O3/c1-2-3-10-22-28-32(16-7-6-11-23(33)34)25(35)31(22)17-18-12-14-19(15-13-18)20-8-4-5-9-21(20)24-26-29-30-27-24/h4-5,8-9,12-15H,2-3,6-7,10-11,16-17H2,1H3,(H,33,34)(H,26,27,29,30)
Reactome pathway
n/an/a 12n/an/an/an/an/an/a
Searle R&D
Curated by ChEMBL
Assay Description
Inhibition of [125I]-angiotensin-II binding to the angiotensin II receptor type 1 in rat uterine membranes
J Med Chem 36: 2172-81 (1993)
BindingDB Entry DOI: 10.7270/Q2C53JXM
Angiotensin II receptor (AT-1) type-1
(RAT)
BDBM50044369
(5-{3-Butyl-5-oxo-4-[2'-(1H-tetrazol-5-yl)-biphenyl...)
Show SMILES CCCCc1nn(CCCCC(O)=O)c(=O)n1Cc1ccc(cc1)-c1ccccc1-c1nnn[nH]1
Show InChI InChI=1S/C25H29N7O3/c1-2-3-10-22-28-32(16-7-6-11-23(33)34)25(35)31(22)17-18-12-14-19(15-13-18)20-8-4-5-9-21(20)24-26-29-30-27-24/h4-5,8-9,12-15H,2-3,6-7,10-11,16-17H2,1H3,(H,33,34)(H,26,27,29,30)
n/an/a 12n/an/an/an/an/an/a
TBA
Assay Description
Displacement of [125I]-angiotensin 2 from angiotensin AT1 receptor in Rattus norvegicus (rat) uterine membranes
Citation and Details
Article DOI: 10.1007/s00044-011-9622-4
BindingDB Entry DOI: 10.7270/Q2T156HH
Angiotensin II receptor (AT-1) type-1
(RAT)
BDBM50044369
(5-{3-Butyl-5-oxo-4-[2'-(1H-tetrazol-5-yl)-biphenyl...)
Show SMILES CCCCc1nn(CCCCC(O)=O)c(=O)n1Cc1ccc(cc1)-c1ccccc1-c1nnn[nH]1
Show InChI InChI=1S/C25H29N7O3/c1-2-3-10-22-28-32(16-7-6-11-23(33)34)25(35)31(22)17-18-12-14-19(15-13-18)20-8-4-5-9-21(20)24-26-29-30-27-24/h4-5,8-9,12-15H,2-3,6-7,10-11,16-17H2,1H3,(H,33,34)(H,26,27,29,30)
n/an/a 12n/an/an/an/an/an/a
TBA
Assay Description
Displacement of [125I]-angiotensin 2 from angiotensin AT1 receptor in Rattus norvegicus (rat) uterine membranes
Citation and Details
Article DOI: 10.1007/s00044-011-9622-4
BindingDB Entry DOI: 10.7270/Q2T156HH