BDBM50044572 CHEMBL3341912
SMILES: FC(F)(F)c1ccc2Sc3nc(Cl)ncc3C(=O)Nc2c1
InChI Key: InChIKey=JTURLWVYGOCZPN-UHFFFAOYSA-N
Data: 1 IC50
Activity Spreadsheet -- Enzyme Inhibition Constant Data from BindingDB
Found 1 hit for monomerid = 50044572
Trg + Lig
Ki
nM
ΔG°
kcal/mole
IC50
nM
Kd
nM
EC50/IC50
nM
koff
s-1
kon
M-1s-1
pHTemp
°C
Transcription factor AP-1
(Homo sapiens (Human))
BDBM50044572
(CHEMBL3341912)
Show SMILES FC(F)(F)c1ccc2Sc3nc(Cl)ncc3C(=O)Nc2c1
Show InChI InChI=1S/C12H5ClF3N3OS/c13-11-17-4-6-9(20)18-7-3-5(12(14,15)16)1-2-8(7)21-10(6)19-11/h1-4H,(H,18,20)
n/an/a 100n/an/an/an/an/an/a
University of Texas Medical Branch
Curated by ChEMBL
Assay Description
Inhibition of AP-1-mediated transcriptional activation in human Jurkat cells by luciferase reporter gene assay
J Med Chem 57: 6930-48 (2014)
Article DOI: 10.1021/jm5004733
BindingDB Entry DOI: 10.7270/Q2222WDT