BDBM50044666 CHEMBL3353340::US10358436, Example A22
SMILES: O=C1Nc2ccccc2[C@]11C[C@H]1c1ccc2c(\C=C\c3ccncc3)n[nH]c2c1
InChI Key:
Data: 15 IC50
Activity Spreadsheet -- Enzyme Inhibition Constant Data from BindingDB
Found 15 hits for monomerid = 50044666
Trg + Lig
Ki
nM
ΔG°
kcal/mole
IC50
nM
Kd
nM
EC50/IC50
nM
koff
s-1
kon
M-1s-1
pHTemp
°C
Cytochrome P450 2C9
(Homo sapiens (Human))
BDBM50044666
(CHEMBL3353340 | US10358436, Example A22)
Show SMILES O=C1Nc2ccccc2[C@]11C[C@H]1c1ccc2c(\C=C\c3ccncc3)n[nH]c2c1 |r|
Reactome pathway
n/an/a 30n/an/an/an/an/an/a
EntreMed Inc.
Curated by ChEMBL
Assay Description
Inhibition of CYP2C9 (unknown origin) using MFC substrate after 45 mins by fluorescence assay
J Med Chem 58: 130-46 (2015)
Article DOI: 10.1021/jm5005336
BindingDB Entry DOI: 10.7270/Q2125V9W
Aurora kinase B
(Homo sapiens (Human))
BDBM50044666
(CHEMBL3353340 | US10358436, Example A22)
Show SMILES O=C1Nc2ccccc2[C@]11C[C@H]1c1ccc2c(\C=C\c3ccncc3)n[nH]c2c1 |r|
Reactome pathway
US Patent
n/an/a<100n/an/an/an/an/an/a
University Health Network
US Patent
Assay Description
Aurora B inhibition was determined using the Z-Lyte assay kit from Invitrogen. The assay was performed using the recommended manufacturer's instr...
US Patent US10358436 (2019)
BindingDB Entry DOI: 10.7270/Q2K939WH
Vascular endothelial growth factor receptor 2
(Homo sapiens (Human))
BDBM50044666
(CHEMBL3353340 | US10358436, Example A22)
Show SMILES O=C1Nc2ccccc2[C@]11C[C@H]1c1ccc2c(\C=C\c3ccncc3)n[nH]c2c1 |r|
NCI pathway
Reactome pathway
n/an/a 1.30E+3n/an/an/an/an/an/a
EntreMed Inc.
Curated by ChEMBL
Assay Description
Inhibition of KDR (unknown origin) by FRET-based homogeneous assay
J Med Chem 58: 130-46 (2015)
Article DOI: 10.1021/jm5005336
BindingDB Entry DOI: 10.7270/Q2125V9W
Receptor-type tyrosine-protein kinase FLT3
(Homo sapiens (Human))
BDBM50044666
(CHEMBL3353340 | US10358436, Example A22)
Show SMILES O=C1Nc2ccccc2[C@]11C[C@H]1c1ccc2c(\C=C\c3ccncc3)n[nH]c2c1 |r|
n/an/a 33n/an/an/an/an/an/a
EntreMed Inc.
Curated by ChEMBL
Assay Description
Inhibition of FLT3 (unknown origin) by FRET-based homogeneous assay
J Med Chem 58: 130-46 (2015)
Article DOI: 10.1021/jm5005336
BindingDB Entry DOI: 10.7270/Q2125V9W
Serine/threonine-protein kinase PLK2
(Homo sapiens (Human))
BDBM50044666
(CHEMBL3353340 | US10358436, Example A22)
Show SMILES O=C1Nc2ccccc2[C@]11C[C@H]1c1ccc2c(\C=C\c3ccncc3)n[nH]c2c1 |r|
NCI pathway
n/an/a>1.00E+5n/an/an/an/an/an/a
EntreMed Inc.
Curated by ChEMBL
Assay Description
Inhibition of PLK2 (unknown origin) by FRET-based homogeneous assay
J Med Chem 58: 130-46 (2015)
Article DOI: 10.1021/jm5005336
BindingDB Entry DOI: 10.7270/Q2125V9W
Serine/threonine-protein kinase PLK3
(Homo sapiens (Human))
BDBM50044666
(CHEMBL3353340 | US10358436, Example A22)
Show SMILES O=C1Nc2ccccc2[C@]11C[C@H]1c1ccc2c(\C=C\c3ccncc3)n[nH]c2c1 |r|
NCI pathway
n/an/a>1.00E+5n/an/an/an/an/an/a
EntreMed Inc.
Curated by ChEMBL
Assay Description
Inhibition of PLK3 (unknown origin) by FRET-based homogeneous assay
J Med Chem 58: 130-46 (2015)
Article DOI: 10.1021/jm5005336
BindingDB Entry DOI: 10.7270/Q2125V9W
Aurora kinase B
(Homo sapiens (Human))
BDBM50044666
(CHEMBL3353340 | US10358436, Example A22)
Show SMILES O=C1Nc2ccccc2[C@]11C[C@H]1c1ccc2c(\C=C\c3ccncc3)n[nH]c2c1 |r|
Reactome pathway
n/an/a 7.40n/an/an/an/an/an/a
EntreMed Inc.
Curated by ChEMBL
Assay Description
Inhibition of AURKB (unknown origin) by FRET-based homogeneous assay
J Med Chem 58: 130-46 (2015)
Article DOI: 10.1021/jm5005336
BindingDB Entry DOI: 10.7270/Q2125V9W
Cytochrome P450 3A4
(Homo sapiens (Human))
BDBM50044666
(CHEMBL3353340 | US10358436, Example A22)
Show SMILES O=C1Nc2ccccc2[C@]11C[C@H]1c1ccc2c(\C=C\c3ccncc3)n[nH]c2c1 |r|
Reactome pathway
n/an/a>1.00E+3n/an/an/an/an/an/a
EntreMed Inc.
Curated by ChEMBL
Assay Description
Inhibition of CYP3A4 (unknown origin) using BFC substrate after 30 mins by fluorescence assay
J Med Chem 58: 130-46 (2015)
Article DOI: 10.1021/jm5005336
BindingDB Entry DOI: 10.7270/Q2125V9W
Serine/threonine-protein kinase PLK1
(Homo sapiens (Human))
BDBM50044666
(CHEMBL3353340 | US10358436, Example A22)
Show SMILES O=C1Nc2ccccc2[C@]11C[C@H]1c1ccc2c(\C=C\c3ccncc3)n[nH]c2c1 |r|
NCI pathway
Reactome pathway
n/an/a>1.00E+5n/an/an/an/an/an/a
EntreMed Inc.
Curated by ChEMBL
Assay Description
Inhibition of PLK1 (unknown origin) by FRET-based homogeneous assay
J Med Chem 58: 130-46 (2015)
Article DOI: 10.1021/jm5005336
BindingDB Entry DOI: 10.7270/Q2125V9W
Serine/threonine-protein kinase PLK4
(Homo sapiens (Human))
BDBM50044666
(CHEMBL3353340 | US10358436, Example A22)
Show SMILES O=C1Nc2ccccc2[C@]11C[C@H]1c1ccc2c(\C=C\c3ccncc3)n[nH]c2c1 |r|
NCI pathway
Reactome pathway
n/an/a 3.60n/an/an/an/an/an/a
EntreMed Inc.
Curated by ChEMBL
Assay Description
Inhibition of human N-terminal GST-tagged PLK4 (1 to 391 residues) expressed in Escherichia coli incubated for 30 mins by ELISA method
J Med Chem 58: 130-46 (2015)
Article DOI: 10.1021/jm5005336
BindingDB Entry DOI: 10.7270/Q2125V9W
Cytochrome P450 2C19
(Homo sapiens (Human))
BDBM50044666
(CHEMBL3353340 | US10358436, Example A22)
Show SMILES O=C1Nc2ccccc2[C@]11C[C@H]1c1ccc2c(\C=C\c3ccncc3)n[nH]c2c1 |r|
Reactome pathway
n/an/a 260n/an/an/an/an/an/a
EntreMed Inc.
Curated by ChEMBL
Assay Description
Inhibition of CYP2C19 (unknown origin) using MFC substrate after 30 mins by fluorescence assay
J Med Chem 58: 130-46 (2015)
Article DOI: 10.1021/jm5005336
BindingDB Entry DOI: 10.7270/Q2125V9W
Cytochrome P450 2D6
(Homo sapiens (Human))
BDBM50044666
(CHEMBL3353340 | US10358436, Example A22)
Show SMILES O=C1Nc2ccccc2[C@]11C[C@H]1c1ccc2c(\C=C\c3ccncc3)n[nH]c2c1 |r|
n/an/a 700n/an/an/an/an/an/a
EntreMed Inc.
Curated by ChEMBL
Assay Description
Inhibition of CYP2D6 (unknown origin) using AMMC substrate after 45 mins by fluorescence assay
J Med Chem 58: 130-46 (2015)
Article DOI: 10.1021/jm5005336
BindingDB Entry DOI: 10.7270/Q2125V9W
Serine/threonine-protein kinase PLK4
(Homo sapiens (Human))
BDBM50044666
(CHEMBL3353340 | US10358436, Example A22)
Show SMILES O=C1Nc2ccccc2[C@]11C[C@H]1c1ccc2c(\C=C\c3ccncc3)n[nH]c2c1 |r|
US Patent
n/an/a<100n/an/an/an/an/an/a
University Health Network
US Patent
Assay Description
Active PLK4 was purified from an E. coli expression system as an amino terminal GST fusion of residues 1-391 of human PLK4. The protein was purified ...
US Patent US10358436 (2019)
BindingDB Entry DOI: 10.7270/Q2K939WH
Aurora kinase A
(Homo sapiens (Human))
BDBM50044666
(CHEMBL3353340 | US10358436, Example A22)
Show SMILES O=C1Nc2ccccc2[C@]11C[C@H]1c1ccc2c(\C=C\c3ccncc3)n[nH]c2c1 |r|
NCI pathway
Reactome pathway
US Patent
n/an/a<100n/an/an/an/an/an/a
University Health Network
US Patent
Assay Description
Aurora A inhibition was determined using the Z-Lyte assay kit from Invitrogen. The assay was performed using the recommended manufacturer's instr...
US Patent US10358436 (2019)
BindingDB Entry DOI: 10.7270/Q2K939WH
Cytochrome P450 1A
(Homo sapiens (Human))
BDBM50044666
(CHEMBL3353340 | US10358436, Example A22)
Show SMILES O=C1Nc2ccccc2[C@]11C[C@H]1c1ccc2c(\C=C\c3ccncc3)n[nH]c2c1 |r|
Reactome pathway
n/an/a 1.40E+3n/an/an/an/an/an/a
EntreMed Inc.
Curated by ChEMBL
Assay Description
Inhibition of CYP1A2 (unknown origin) using CEC substrate after 15 mins by fluorescence assay
J Med Chem 58: 130-46 (2015)
Article DOI: 10.1021/jm5005336
BindingDB Entry DOI: 10.7270/Q2125V9W