BDBM50044667 CHEMBL3353362::US10358436, Example A58::US9907800, Example A58
SMILES: O=C1Nc2ccccc2[C@]11C[C@H]1c1ccc2c(\C=C\c3ccc(CN4CCCCC4)cc3)n[nH]c2c1
InChI Key:
Data: 14 IC50
Activity Spreadsheet -- Enzyme Inhibition Constant Data from BindingDB
Found 14 hits for monomerid = 50044667
Trg + Lig
Ki
nM
ΔG°
kcal/mole
IC50
nM
Kd
nM
EC50/IC50
nM
koff
s-1
kon
M-1s-1
pHTemp
°C
Aurora kinase B
(Homo sapiens (Human))
BDBM50044667
(CHEMBL3353362 | US10358436, Example A58 | US990780...)
Show SMILES O=C1Nc2ccccc2[C@]11C[C@H]1c1ccc2c(\C=C\c3ccc(CN4CCCCC4)cc3)n[nH]c2c1 |r|
Reactome pathway
n/an/a 14n/an/an/an/an/an/a
EntreMed Inc.
Curated by ChEMBL
Assay Description
Inhibition of AURKB (unknown origin) by FRET-based homogeneous assay
J Med Chem 58: 130-46 (2015)
Article DOI: 10.1021/jm5005336
BindingDB Entry DOI: 10.7270/Q2125V9W
Receptor-type tyrosine-protein kinase FLT3
(Homo sapiens (Human))
BDBM50044667
(CHEMBL3353362 | US10358436, Example A58 | US990780...)
Show SMILES O=C1Nc2ccccc2[C@]11C[C@H]1c1ccc2c(\C=C\c3ccc(CN4CCCCC4)cc3)n[nH]c2c1 |r|
n/an/a 15n/an/an/an/an/an/a
EntreMed Inc.
Curated by ChEMBL
Assay Description
Inhibition of FLT3 (unknown origin) by FRET-based homogeneous assay
J Med Chem 58: 130-46 (2015)
Article DOI: 10.1021/jm5005336
BindingDB Entry DOI: 10.7270/Q2125V9W
Vascular endothelial growth factor receptor 2
(Homo sapiens (Human))
BDBM50044667
(CHEMBL3353362 | US10358436, Example A58 | US990780...)
Show SMILES O=C1Nc2ccccc2[C@]11C[C@H]1c1ccc2c(\C=C\c3ccc(CN4CCCCC4)cc3)n[nH]c2c1 |r|
NCI pathway
Reactome pathway
n/an/a 12n/an/an/an/an/an/a
EntreMed Inc.
Curated by ChEMBL
Assay Description
Inhibition of KDR (unknown origin) by FRET-based homogeneous assay
J Med Chem 58: 130-46 (2015)
Article DOI: 10.1021/jm5005336
BindingDB Entry DOI: 10.7270/Q2125V9W
Serine/threonine-protein kinase PLK4
(Homo sapiens (Human))
BDBM50044667
(CHEMBL3353362 | US10358436, Example A58 | US990780...)
Show SMILES O=C1Nc2ccccc2[C@]11C[C@H]1c1ccc2c(\C=C\c3ccc(CN4CCCCC4)cc3)n[nH]c2c1 |r|
NCI pathway
Reactome pathway
n/an/a 6.70n/an/an/an/an/an/a
EntreMed Inc.
Curated by ChEMBL
Assay Description
Inhibition of human N-terminal GST-tagged PLK4 (1 to 391 residues) expressed in Escherichia coli incubated for 30 mins by ELISA method
J Med Chem 58: 130-46 (2015)
Article DOI: 10.1021/jm5005336
BindingDB Entry DOI: 10.7270/Q2125V9W
Serine/threonine-protein kinase PLK4
(Homo sapiens (Human))
BDBM50044667
(CHEMBL3353362 | US10358436, Example A58 | US990780...)
Show SMILES O=C1Nc2ccccc2[C@]11C[C@H]1c1ccc2c(\C=C\c3ccc(CN4CCCCC4)cc3)n[nH]c2c1 |r|
NCI pathway
Reactome pathway
n/an/a 0.900n/an/an/an/an/an/a
TBA
Curated by ChEMBL
Assay Description
Inhibition of PLK4 (unknown origin) by ELISA
J Med Chem 58: 147-69 (2015)
BindingDB Entry DOI: 10.7270/Q2M0475V
Serine/threonine-protein kinase PLK4
(Homo sapiens (Human))
BDBM50044667
(CHEMBL3353362 | US10358436, Example A58 | US990780...)
Show SMILES O=C1Nc2ccccc2[C@]11C[C@H]1c1ccc2c(\C=C\c3ccc(CN4CCCCC4)cc3)n[nH]c2c1 |r|
NCI pathway
Reactome pathway
US Patent
n/an/a<100n/an/an/an/an/an/a
The Scripps Research Institute
Assay Description
PLK4 activity was measured using an indirect ELISA detection system. Dephosphorylated GST-PLK4 (4 nM) was incubated in the presence of 15 μM ATP...
J Med Chem 50: 3359-68 (2007)
BindingDB Entry DOI: 10.7270/Q2KD216W
Receptor-type tyrosine-protein kinase FLT3
(Homo sapiens (Human))
BDBM50044667
(CHEMBL3353362 | US10358436, Example A58 | US990780...)
Show SMILES O=C1Nc2ccccc2[C@]11C[C@H]1c1ccc2c(\C=C\c3ccc(CN4CCCCC4)cc3)n[nH]c2c1 |r|
US Patent
n/an/a<100n/an/an/an/an/an/a
University Health Network
US Patent
Assay Description
PLK3 inhibition was determined using the Z-Lyte assay kit from Invitrogen (cat #PV3802). The assay was performed using the recommended manufacturer&#...
US Patent US10358436 (2019)
BindingDB Entry DOI: 10.7270/Q2K939WH
Serine/threonine-protein kinase PLK4
(Homo sapiens (Human))
BDBM50044667
(CHEMBL3353362 | US10358436, Example A58 | US990780...)
Show SMILES O=C1Nc2ccccc2[C@]11C[C@H]1c1ccc2c(\C=C\c3ccc(CN4CCCCC4)cc3)n[nH]c2c1 |r|
NCI pathway
Reactome pathway
US Patent
n/an/a<100n/an/an/an/an/an/a
The Scripps Research Institute
Assay Description
PLK4 activity was measured using an indirect ELISA detection system. Dephosphorylated GST-PLK4 (4 nM) was incubated in the presence of 15 μM ATP...
J Med Chem 50: 3359-68 (2007)
BindingDB Entry DOI: 10.7270/Q2KD216W
Aurora kinase B
(Homo sapiens (Human))
BDBM50044667
(CHEMBL3353362 | US10358436, Example A58 | US990780...)
Show SMILES O=C1Nc2ccccc2[C@]11C[C@H]1c1ccc2c(\C=C\c3ccc(CN4CCCCC4)cc3)n[nH]c2c1 |r|
Reactome pathway
US Patent
n/an/a<100n/an/an/an/an/an/a
The Scripps Research Institute
Assay Description
Aurora B inhibition was determined using the Z-Lyte assay kit from Invitrogen. The assay was performed using the recommended manufacturer's instr...
J Med Chem 50: 3359-68 (2007)
BindingDB Entry DOI: 10.7270/Q2KD216W
Receptor-type tyrosine-protein kinase FLT3
(Homo sapiens (Human))
BDBM50044667
(CHEMBL3353362 | US10358436, Example A58 | US990780...)
Show SMILES O=C1Nc2ccccc2[C@]11C[C@H]1c1ccc2c(\C=C\c3ccc(CN4CCCCC4)cc3)n[nH]c2c1 |r|
US Patent
n/an/a<100n/an/an/an/an/an/a
The Scripps Research Institute
Assay Description
The enzymatic activity of FLT3 was determined using the Z-Lyte assay kit from Invitrogen (Invitrogen cat #PV3191). The assay was performed using the ...
J Med Chem 50: 3359-68 (2007)
BindingDB Entry DOI: 10.7270/Q2KD216W
Serine/threonine-protein kinase PLK4
(Homo sapiens (Human))
BDBM50044667
(CHEMBL3353362 | US10358436, Example A58 | US990780...)
Show SMILES O=C1Nc2ccccc2[C@]11C[C@H]1c1ccc2c(\C=C\c3ccc(CN4CCCCC4)cc3)n[nH]c2c1 |r|
US Patent
n/an/a<100n/an/an/an/an/an/a
University Health Network
US Patent
Assay Description
Active PLK4 was purified from an E. coli expression system as an amino terminal GST fusion of residues 1-391 of human PLK4. The protein was purified ...
US Patent US10358436 (2019)
BindingDB Entry DOI: 10.7270/Q2K939WH
Aurora kinase A
(Homo sapiens (Human))
BDBM50044667
(CHEMBL3353362 | US10358436, Example A58 | US990780...)
Show SMILES O=C1Nc2ccccc2[C@]11C[C@H]1c1ccc2c(\C=C\c3ccc(CN4CCCCC4)cc3)n[nH]c2c1 |r|
NCI pathway
Reactome pathway
US Patent
n/an/a<500n/an/an/an/an/an/a
University Health Network
US Patent
Assay Description
Aurora A inhibition was determined using the Z-Lyte assay kit from Invitrogen. The assay was performed using the recommended manufacturer's instr...
US Patent US10358436 (2019)
BindingDB Entry DOI: 10.7270/Q2K939WH
Aurora kinase B
(Homo sapiens (Human))
BDBM50044667
(CHEMBL3353362 | US10358436, Example A58 | US990780...)
Show SMILES O=C1Nc2ccccc2[C@]11C[C@H]1c1ccc2c(\C=C\c3ccc(CN4CCCCC4)cc3)n[nH]c2c1 |r|
Reactome pathway
US Patent
n/an/a<100n/an/an/an/an/an/a
University Health Network
US Patent
Assay Description
Aurora B inhibition was determined using the Z-Lyte assay kit from Invitrogen. The assay was performed using the recommended manufacturer's instr...
US Patent US10358436 (2019)
BindingDB Entry DOI: 10.7270/Q2K939WH
Aurora kinase B
(Homo sapiens (Human))
BDBM50044667
(CHEMBL3353362 | US10358436, Example A58 | US990780...)
Show SMILES O=C1Nc2ccccc2[C@]11C[C@H]1c1ccc2c(\C=C\c3ccc(CN4CCCCC4)cc3)n[nH]c2c1 |r|
Reactome pathway
US Patent
n/an/a 550n/an/an/an/an/an/a
The Scripps Research Institute
Assay Description
Aurora B inhibition was determined using the Z-Lyte assay kit from Invitrogen. The assay was performed using the recommended manufacturer's instr...
J Med Chem 50: 3359-68 (2007)
BindingDB Entry DOI: 10.7270/Q2KD216W