BDBM50044842 CHEMBL3309280
SMILES: CC(C)Nc1cc(NC(=O)c2c(F)cccc2F)cc(c1)C(F)(F)F
InChI Key: InChIKey=HTFLIVOZSFVGEJ-UHFFFAOYSA-N
Data: 1 IC50
Activity Spreadsheet -- Enzyme Inhibition Constant Data from BindingDB
Found 1 hit for monomerid = 50044842
Trg + Lig
Ki
nM
ΔG°
kcal/mole
IC50
nM
Kd
nM
EC50/IC50
nM
koff
s-1
kon
M-1s-1
pHTemp
°C
Transient receptor potential cation channel subfamily A member 1
(Homo sapiens (Human))
BDBM50044842
(CHEMBL3309280)
Show SMILES CC(C)Nc1cc(NC(=O)c2c(F)cccc2F)cc(c1)C(F)(F)F
Show InChI InChI=1S/C17H15F5N2O/c1-9(2)23-11-6-10(17(20,21)22)7-12(8-11)24-16(25)15-13(18)4-3-5-14(15)19/h3-9,23H,1-2H3,(H,24,25)
n/an/a 91n/an/an/an/an/an/a
AstraZeneca
Curated by ChEMBL
Assay Description
Antagonist activity at human TRPA1 expressed in HEK293-TREx cells assessed as change in calcium level by Fluo-4NW assay
Bioorg Med Chem Lett 24: 3204-6 (2014)
Article DOI: 10.1016/j.bmcl.2014.05.013
BindingDB Entry DOI: 10.7270/Q2H41T2V