BDBM50044853 CHEMBL3311305
SMILES: COc1ccc(cc1)S(=O)(=O)Nc1ccc(C)cc1C
InChI Key: InChIKey=ZFVBRSBDQOUGQK-UHFFFAOYSA-N
Data: 1 EC50
Activity Spreadsheet -- Enzyme Inhibition Constant Data from BindingDB
Found 1 hit for monomerid = 50044853
Trg + Lig
Ki
nM
ΔG°
kcal/mole
IC50
nM
Kd
nM
EC50/IC50
nM
koff
s-1
kon
M-1s-1
pHTemp
°C
Free fatty acid receptor 4
(Homo sapiens (Human))
BDBM50044853
(CHEMBL3311305)
Show SMILES COc1ccc(cc1)S(=O)(=O)Nc1ccc(C)cc1C
Show InChI InChI=1S/C15H17NO3S/c1-11-4-9-15(12(2)10-11)16-20(17,18)14-7-5-13(19-3)6-8-14/h4-10,16H,1-3H3
Reactome pathway
n/an/an/an/a 2.51E+3n/an/an/an/a
GlaxoSmithKline
Curated by ChEMBL
Assay Description
Agonist activity at human FFA4 receptor expressed in U2OS cells assessed as calcium mobilization after 24 hrs by FLIPR
Bioorg Med Chem Lett 24: 3100-3 (2014)
Article DOI: 10.1016/j.bmcl.2014.05.012
BindingDB Entry DOI: 10.7270/Q2CC1292