BDBM50044860 CHEMBL3311197
SMILES: COc1ccc(cc1)S(=O)(=O)Nc1c(C)cc(Cl)cc1C
InChI Key: InChIKey=NQRHYCHKCJXYEJ-UHFFFAOYSA-N
Data: 1 EC50
Activity Spreadsheet -- Enzyme Inhibition Constant Data from BindingDB
Found 1 hit for monomerid = 50044860
Trg + Lig
Ki
nM
ΔG°
kcal/mole
IC50
nM
Kd
nM
EC50/IC50
nM
koff
s-1
kon
M-1s-1
pHTemp
°C
Free fatty acid receptor 4
(Homo sapiens (Human))
BDBM50044860
(CHEMBL3311197)
Show SMILES COc1ccc(cc1)S(=O)(=O)Nc1c(C)cc(Cl)cc1C
Show InChI InChI=1S/C15H16ClNO3S/c1-10-8-12(16)9-11(2)15(10)17-21(18,19)14-6-4-13(20-3)5-7-14/h4-9,17H,1-3H3
Reactome pathway
n/an/an/an/a 501n/an/an/an/a
GlaxoSmithKline
Curated by ChEMBL
Assay Description
Agonist activity at human FFA4 receptor expressed in U2OS cells assessed as calcium mobilization after 24 hrs by FLIPR
Bioorg Med Chem Lett 24: 3100-3 (2014)
Article DOI: 10.1016/j.bmcl.2014.05.012
BindingDB Entry DOI: 10.7270/Q2CC1292