BDBM50044914 CHEMBL3311311
SMILES: COc1ccccc1S(=O)(=O)Nc1c(C)cc(C)cc1C
InChI Key: InChIKey=PBBXWDGIVWJYBC-UHFFFAOYSA-N
Data: 1 EC50
Activity Spreadsheet -- Enzyme Inhibition Constant Data from BindingDB
Found 1 hit for monomerid = 50044914
Trg + Lig
Ki
nM
ΔG°
kcal/mole
IC50
nM
Kd
nM
EC50/IC50
nM
koff
s-1
kon
M-1s-1
pHTemp
°C
Free fatty acid receptor 4
(Homo sapiens (Human))
BDBM50044914
(CHEMBL3311311)
Show SMILES COc1ccccc1S(=O)(=O)Nc1c(C)cc(C)cc1C
Show InChI InChI=1S/C16H19NO3S/c1-11-9-12(2)16(13(3)10-11)17-21(18,19)15-8-6-5-7-14(15)20-4/h5-10,17H,1-4H3
Reactome pathway
n/an/an/an/a<3.16E+4n/an/an/an/a
GlaxoSmithKline
Curated by ChEMBL
Assay Description
Agonist activity at human FFA4 receptor expressed in U2OS cells assessed as calcium mobilization after 24 hrs by FLIPR
Bioorg Med Chem Lett 24: 3100-3 (2014)
Article DOI: 10.1016/j.bmcl.2014.05.012
BindingDB Entry DOI: 10.7270/Q2CC1292