BDBM50044917 CHEMBL3311321
SMILES: Cc1cc(C)c(NS(=O)(=O)c2ccc(cc2)-c2ccccc2)c(C)c1
InChI Key: InChIKey=LAOJNOHPRCPMNL-UHFFFAOYSA-N
Data: 1 EC50
Activity Spreadsheet -- Enzyme Inhibition Constant Data from BindingDB
Found 1 hit for monomerid = 50044917
Trg + Lig
Ki
nM
ΔG°
kcal/mole
IC50
nM
Kd
nM
EC50/IC50
nM
koff
s-1
kon
M-1s-1
pHTemp
°C
Free fatty acid receptor 4
(Homo sapiens (Human))
BDBM50044917
(CHEMBL3311321)
Show SMILES Cc1cc(C)c(NS(=O)(=O)c2ccc(cc2)-c2ccccc2)c(C)c1
Show InChI InChI=1S/C21H21NO2S/c1-15-13-16(2)21(17(3)14-15)22-25(23,24)20-11-9-19(10-12-20)18-7-5-4-6-8-18/h4-14,22H,1-3H3
Reactome pathway
n/an/an/an/a<3.16E+4n/an/an/an/a
GlaxoSmithKline
Curated by ChEMBL
Assay Description
Agonist activity at human FFA4 receptor expressed in U2OS cells assessed as calcium mobilization after 24 hrs by FLIPR
Bioorg Med Chem Lett 24: 3100-3 (2014)
Article DOI: 10.1016/j.bmcl.2014.05.012
BindingDB Entry DOI: 10.7270/Q2CC1292