BDBM50044942 CHEMBL3311492
SMILES: CCOC(=O)C1(Cc2ccccc2-c2ccc(Cl)cc2)CCN(CC1)c1ccc(cc1)C(=O)NS(=O)(=O)c1ccc(N[C@H](CCN2CCOCC2)CSc2ccccc2)c(c1)S(=O)(=O)C(F)(F)F
InChI Key: InChIKey=KMPPJGOVTXGJFJ-LDLOPFEMSA-N
Data: 2 IC50
Activity Spreadsheet -- Enzyme Inhibition Constant Data from BindingDB
Found 2 hits for monomerid = 50044942
Trg + Lig
Ki
nM
ΔG°
kcal/mole
IC50
nM
Kd
nM
EC50/IC50
nM
koff
s-1
kon
M-1s-1
pHTemp
°C
Bcl-2-like protein 1
(Homo sapiens (Human))
BDBM50044942
(CHEMBL3311492)
Show SMILES CCOC(=O)C1(Cc2ccccc2-c2ccc(Cl)cc2)CCN(CC1)c1ccc(cc1)C(=O)NS(=O)(=O)c1ccc(N[C@H](CCN2CCOCC2)CSc2ccccc2)c(c1)S(=O)(=O)C(F)(F)F |r|
Show InChI InChI=1S/C49H52ClF3N4O8S3/c1-2-65-47(59)48(33-37-8-6-7-11-43(37)35-12-16-38(50)17-13-35)23-26-57(27-24-48)40-18-14-36(15-19-40)46(58)55-68(62,63)42-20-21-44(45(32-42)67(60,61)49(51,52)53)54-39(22-25-56-28-30-64-31-29-56)34-66-41-9-4-3-5-10-41/h3-21,32,39,54H,2,22-31,33-34H2,1H3,(H,55,58)/t39-/m1/s1
NCI pathway
Reactome pathway
n/an/a 30n/an/an/an/an/an/a
AstraZeneca
Curated by ChEMBL
Assay Description
Inhibition of c-terminal 6xHis-tagged Bcl-xL (amino acids 1 to 209) (unknown origin) preincubated for 1 hr prior to substrate addition measured after...
Bioorg Med Chem Lett 24: 3026-33 (2014)
Article DOI: 10.1016/j.bmcl.2014.05.036
BindingDB Entry DOI: 10.7270/Q27M09JW
Apoptosis regulator Bcl-2
(Homo sapiens (Human))
BDBM50044942
(CHEMBL3311492)
Show SMILES CCOC(=O)C1(Cc2ccccc2-c2ccc(Cl)cc2)CCN(CC1)c1ccc(cc1)C(=O)NS(=O)(=O)c1ccc(N[C@H](CCN2CCOCC2)CSc2ccccc2)c(c1)S(=O)(=O)C(F)(F)F |r|
Show InChI InChI=1S/C49H52ClF3N4O8S3/c1-2-65-47(59)48(33-37-8-6-7-11-43(37)35-12-16-38(50)17-13-35)23-26-57(27-24-48)40-18-14-36(15-19-40)46(58)55-68(62,63)42-20-21-44(45(32-42)67(60,61)49(51,52)53)54-39(22-25-56-28-30-64-31-29-56)34-66-41-9-4-3-5-10-41/h3-21,32,39,54H,2,22-31,33-34H2,1H3,(H,55,58)/t39-/m1/s1
n/an/a 17n/an/an/an/an/an/a
AstraZeneca
Curated by ChEMBL
Assay Description
Inhibition of c-terminal 6xHis-tagged Bcl-2 (amino acids 1 to 204) (unknown origin) preincubated for 1 hr prior to substrate addition measured after ...
Bioorg Med Chem Lett 24: 3026-33 (2014)
Article DOI: 10.1016/j.bmcl.2014.05.036
BindingDB Entry DOI: 10.7270/Q27M09JW