BDBM50044944 CHEMBL3311493
SMILES: OCC1(Cc2ccccc2-c2ccc(Cl)cc2)CCN(CC1)c1ccc(cc1)C(=O)NS(=O)(=O)c1ccc(N[C@H](CCN2CCOCC2)CSc2ccccc2)c(c1)S(=O)(=O)C(F)(F)F
InChI Key: InChIKey=XHOBCIPRGGKONP-KXQOOQHDSA-N
Data: 2 IC50
Activity Spreadsheet -- Enzyme Inhibition Constant Data from BindingDB
Found 2 hits for monomerid = 50044944
Trg + Lig
Ki
nM
ΔG°
kcal/mole
IC50
nM
Kd
nM
EC50/IC50
nM
koff
s-1
kon
M-1s-1
pHTemp
°C
Bcl-2-like protein 1
(Homo sapiens (Human))
BDBM50044944
(CHEMBL3311493)
Show SMILES OCC1(Cc2ccccc2-c2ccc(Cl)cc2)CCN(CC1)c1ccc(cc1)C(=O)NS(=O)(=O)c1ccc(N[C@H](CCN2CCOCC2)CSc2ccccc2)c(c1)S(=O)(=O)C(F)(F)F |r|
Show InChI InChI=1S/C47H50ClF3N4O7S3/c48-37-14-10-34(11-15-37)42-9-5-4-6-36(42)31-46(33-56)21-24-55(25-22-46)39-16-12-35(13-17-39)45(57)53-65(60,61)41-18-19-43(44(30-41)64(58,59)47(49,50)51)52-38(20-23-54-26-28-62-29-27-54)32-63-40-7-2-1-3-8-40/h1-19,30,38,52,56H,20-29,31-33H2,(H,53,57)/t38-/m1/s1
NCI pathway
Reactome pathway
n/an/a<10n/an/an/an/an/an/a
AstraZeneca
Curated by ChEMBL
Assay Description
Inhibition of c-terminal 6xHis-tagged Bcl-xL (amino acids 1 to 209) (unknown origin) preincubated for 1 hr prior to substrate addition measured after...
Bioorg Med Chem Lett 24: 3026-33 (2014)
Article DOI: 10.1016/j.bmcl.2014.05.036
BindingDB Entry DOI: 10.7270/Q27M09JW
Apoptosis regulator Bcl-2
(Homo sapiens (Human))
BDBM50044944
(CHEMBL3311493)
Show SMILES OCC1(Cc2ccccc2-c2ccc(Cl)cc2)CCN(CC1)c1ccc(cc1)C(=O)NS(=O)(=O)c1ccc(N[C@H](CCN2CCOCC2)CSc2ccccc2)c(c1)S(=O)(=O)C(F)(F)F |r|
Show InChI InChI=1S/C47H50ClF3N4O7S3/c48-37-14-10-34(11-15-37)42-9-5-4-6-36(42)31-46(33-56)21-24-55(25-22-46)39-16-12-35(13-17-39)45(57)53-65(60,61)41-18-19-43(44(30-41)64(58,59)47(49,50)51)52-38(20-23-54-26-28-62-29-27-54)32-63-40-7-2-1-3-8-40/h1-19,30,38,52,56H,20-29,31-33H2,(H,53,57)/t38-/m1/s1
n/an/a 59n/an/an/an/an/an/a
AstraZeneca
Curated by ChEMBL
Assay Description
Inhibition of c-terminal 6xHis-tagged Bcl-2 (amino acids 1 to 204) (unknown origin) preincubated for 1 hr prior to substrate addition measured after ...
Bioorg Med Chem Lett 24: 3026-33 (2014)
Article DOI: 10.1016/j.bmcl.2014.05.036
BindingDB Entry DOI: 10.7270/Q27M09JW