BDBM50045067 CHEMBL3310413
SMILES: COCCNC(=O)c1c(O)c2ncc(Cc3ccc(F)cc3)cc2n(CC(=O)N2CCCCC2)c1=O
InChI Key: InChIKey=CDKMAVRQWDOIFA-UHFFFAOYSA-N
Data: 1 IC50
Activity Spreadsheet -- Enzyme Inhibition Constant Data from BindingDB
Found 1 hit for monomerid = 50045067
Trg + Lig
Ki
nM
ΔG°
kcal/mole
IC50
nM
Kd
nM
EC50/IC50
nM
koff
s-1
kon
M-1s-1
pHTemp
°C
Integrase
(Human immunodeficiency virus 1)
BDBM50045067
(CHEMBL3310413)
Show SMILES COCCNC(=O)c1c(O)c2ncc(Cc3ccc(F)cc3)cc2n(CC(=O)N2CCCCC2)c1=O
Show InChI InChI=1S/C26H29FN4O5/c1-36-12-9-28-25(34)22-24(33)23-20(14-18(15-29-23)13-17-5-7-19(27)8-6-17)31(26(22)35)16-21(32)30-10-3-2-4-11-30/h5-8,14-15,33H,2-4,9-13,16H2,1H3,(H,28,34)
n/an/a 4.70n/an/an/an/an/an/a
GlaxoSmithKline Research& Development
Curated by ChEMBL
Assay Description
Inhibition of recombinant HIV-1 integrase by strand-transfer assay
Bioorg Med Chem Lett 24: 3104-7 (2014)
Article DOI: 10.1016/j.bmcl.2014.05.011
BindingDB Entry DOI: 10.7270/Q2BC415P