BDBM50045072 CHEMBL3310098
SMILES: COCCNC(=O)c1c(O)c2ncc(Cc3ccc(F)cc3)cc2n(CC(=O)NC2CCC2)c1=O
InChI Key: InChIKey=YZORIORNJBJGDL-UHFFFAOYSA-N
Data: 1 IC50
Activity Spreadsheet -- Enzyme Inhibition Constant Data from BindingDB
Found 1 hit for monomerid = 50045072
Trg + Lig
Ki
nM
ΔG°
kcal/mole
IC50
nM
Kd
nM
EC50/IC50
nM
koff
s-1
kon
M-1s-1
pHTemp
°C
Integrase
(Human immunodeficiency virus 1)
BDBM50045072
(CHEMBL3310098)
Show SMILES COCCNC(=O)c1c(O)c2ncc(Cc3ccc(F)cc3)cc2n(CC(=O)NC2CCC2)c1=O
Show InChI InChI=1S/C25H27FN4O5/c1-35-10-9-27-24(33)21-23(32)22-19(30(25(21)34)14-20(31)29-18-3-2-4-18)12-16(13-28-22)11-15-5-7-17(26)8-6-15/h5-8,12-13,18,32H,2-4,9-11,14H2,1H3,(H,27,33)(H,29,31)
n/an/a 8.5n/an/an/an/an/an/a
GlaxoSmithKline Research& Development
Curated by ChEMBL
Assay Description
Inhibition of recombinant HIV-1 integrase by strand-transfer assay
Bioorg Med Chem Lett 24: 3104-7 (2014)
Article DOI: 10.1016/j.bmcl.2014.05.011
BindingDB Entry DOI: 10.7270/Q2BC415P