BDBM50045074 CHEMBL3310091
SMILES: CN(C)C(=O)Cn1c2cc(Cc3ccc(F)cc3)cnc2c(O)c(C(=O)NC2(CO)CCCC2)c1=O
InChI Key: InChIKey=FXOSOEDOGWALNW-UHFFFAOYSA-N
Data: 1 IC50
Activity Spreadsheet -- Enzyme Inhibition Constant Data from BindingDB
Found 1 hit for monomerid = 50045074
Trg + Lig
Ki
nM
ΔG°
kcal/mole
IC50
nM
Kd
nM
EC50/IC50
nM
koff
s-1
kon
M-1s-1
pHTemp
°C
Integrase
(Human immunodeficiency virus 1)
BDBM50045074
(CHEMBL3310091)
Show SMILES CN(C)C(=O)Cn1c2cc(Cc3ccc(F)cc3)cnc2c(O)c(C(=O)NC2(CO)CCCC2)c1=O
Show InChI InChI=1S/C26H29FN4O5/c1-30(2)20(33)14-31-19-12-17(11-16-5-7-18(27)8-6-16)13-28-22(19)23(34)21(25(31)36)24(35)29-26(15-32)9-3-4-10-26/h5-8,12-13,32,34H,3-4,9-11,14-15H2,1-2H3,(H,29,35)
n/an/a 23n/an/an/an/an/an/a
GlaxoSmithKline Research& Development
Curated by ChEMBL
Assay Description
Inhibition of recombinant HIV-1 integrase by strand-transfer assay
Bioorg Med Chem Lett 24: 3104-7 (2014)
Article DOI: 10.1016/j.bmcl.2014.05.011
BindingDB Entry DOI: 10.7270/Q2BC415P